program: Orca
programVersion: 5.0.2
elementType: Cl S O O N N C C C C C C C C C C C C C C C C C C C H H H H H H H H H H H H H H H H H H H H H H H
charge: 0
multiplicity: 1
keywords: wb97x-d3
keywords: def2-TZVPP
keywords: def2/J RIJCOSX
keywords: DEFGRID2
keywords: scfconv7
keywords: smallprint printgap noloewdin
keywords: NOSOSCF
formula: C19H23ClN2O2S
InChI: InChI=1/C19H23ClN2O2S/c1-2-3-4-5-6-10-13-25-19(23)24-16-14-17(20)21-22-18(16)15-11-8-7-9-12-15/h7-9,11-12,14H,2-6,10,13H2,1H3
48 atoms
Cl -5.869443 -2.18853 -0.918868
S  -0.126498 -2.237897 0.518006
O  -1.816761 -0.534097 1.581666
O  0.105782 -0.664945 2.632218
N  -2.861178 -0.031252 -1.843745
N  -3.977026 -0.717756 -1.875264
C  4.727464 -0.090038 0.078782
C  4.490785 1.180971 0.886758
C  3.928485 -1.29812 0.563472
C  5.285582 2.372953 0.36858
C  2.429477 -1.157015 0.32145
C  5.042171 3.65081 1.16156
C  1.659551 -2.360494 0.837846
C  5.840477 4.836213 0.640315
C  -0.561672 -1.030952 1.714152
C  -2.521535 -0.62144 0.419478
C  -2.124968 0.05636 -0.747981
C  -0.887927 0.851829 -0.861812
C  -0.108979 0.714947 -2.011102
C  -0.494343 1.754515 0.125564
C  -3.689654 -1.334155 0.409233
C  1.050352 1.456703 -2.164212
C  0.665965 2.498493 -0.034923
C  1.442424 2.349426 -1.175317
C  -4.383502 -1.334472 -0.794953
H  5.793503 -0.335101 0.110268
H  4.492884 0.097513 -0.975176
H  4.75305 0.99568 1.934311
H  3.427002 1.437239 0.883965
H  4.117565 -1.455795 1.630587
H  4.288846 -2.196328 0.053178
H  5.032479 2.547175 -0.68356
H  6.354883 2.13405 0.384467
H  2.057671 -0.251073 0.803082
H  2.242972 -1.042293 -0.749195
H  3.974563 3.892552 1.139916
H  5.29008 3.47835 2.213581
H  1.958007 -3.27328 0.318557
H  1.8144 -2.530798 1.90374
H  6.914654 4.646566 0.692393
H  5.640027 5.740709 1.216991
H  5.597351 5.053015 -0.402116
H  -0.405919 0.014611 -2.781051
H  -1.099494 1.906627 1.009787
H  -4.04161 -1.86595 1.283164
H  1.65095 1.334587 -3.056236
H  0.959072 3.201023 0.734281
H  2.348726 2.929297 -1.295586
elementType: Cl S O N C H
totalener: -1856.32872371 hartree
nucrepener: 2512.40796497 hartree
electener: -4368.73668868 hartree
oneelecener: -7536.40896320 hartree
twoeener: 3167.67227452 hartree
cpcmener: -0.02509431 hartree
kineticenergy: 1850.59501450 hartree
xcener: -138.233810535991 hartree
chargesum: -0.0000000
charge: -0.043708 -0.055695 -0.262189 -0.371227 -0.136822 -0.197446 -0.109357 -0.114828 -0.142161 -0.142914 -0.130372 -0.069460 -0.093391 -0.281600 0.327072 0.083488 0.288358 0.017410 -0.174650 -0.179254 -0.095618 -0.176491 -0.163676 -0.128069 0.151876 0.078946 0.060862 0.074899 0.042025 0.069438 0.082571 0.057402 0.068532 0.064053 0.073614 0.050869 0.058656 0.131556 0.116473 0.078697 0.089580 0.077048 0.136211 0.156586 0.156614 0.154797 0.157391 0.163906
qa: -0.0437 -0.0557 -0.2622 -0.3712 -0.1368 -0.1974 -0.1094 -0.1148 -0.1422 -0.1429 -0.1304 -0.0695 -0.0934 -0.2816 0.3271 0.0835 0.2884 0.0174 -0.1746 -0.1793 -0.0956 -0.1765 -0.1637 -0.1281 0.1519 0.0789 0.0609 0.0749 0.0420 0.0694 0.0826 0.0574 0.0685 0.0641 0.0736 0.0509 0.0587 0.1316 0.1165 0.0787 0.0896 0.0770 0.1362 0.1566 0.1566 0.1548 0.1574 0.1639
va: 1.2594 2.4054 2.1115 2.1293 2.9462 2.9358 3.8722 3.8669 3.9446 3.8780 3.8898 3.8678 3.8927 3.9500 4.3411 3.9328 3.7592 3.5670 3.9548 3.8669 4.0149 3.8981 3.8630 3.8219 4.2116 1.0120 1.0126 1.0143 1.0075 1.0092 1.0094 1.0066 1.0112 1.0093 1.0170 1.0081 1.0073 1.0083 1.0247 1.0009 1.0044 1.0004 1.0235 1.0132 1.0069 0.9950 0.9951 0.9824
dispcorr: -0.027557715 hartree
energy: -1856.356281423304
dipole: 76.44834 -74.75506 1.69328 27.92302 -28.54907 -0.62605 7.09592 -6.46530 0.63062
magnitude: 1.91228 au
magnitude: 4.86063 debye
