program: Orca
programVersion: 5.0.2
elementType: Cl S O O N N C C C C C C C C C C C C C C C C C C C H H H H H H H H H H H H H H H H H H H H H H H
charge: 0
multiplicity: 1
keywords: wb97x-d3
keywords: def2-TZVPP
keywords: def2/J RIJCOSX
keywords: DEFGRID2
keywords: scfconv7
keywords: smallprint printgap noloewdin
keywords: NOSOSCF
formula: C19H23ClN2O2S
InChI: InChI=1/C19H23ClN2O2S/c1-2-3-4-5-6-10-13-25-19(23)24-16-14-17(20)21-22-18(16)15-11-8-7-9-12-15/h7-9,11-12,14H,2-6,10,13H2,1H3
48 atoms
Cl -6.37961 -0.716726 0.457609
S  0.80681 -2.689608 0.681741
O  -1.524452 -2.02156 0.010414
O  -0.392935 -0.342614 0.992136
N  -3.428613 0.621319 -1.560026
N  -4.612862 0.43967 -1.025838
C  3.762304 1.087286 1.408674
C  4.988918 1.956774 1.659315
C  4.050741 -0.074753 0.466001
C  4.711424 3.121804 2.601424
C  2.820624 -0.884162 0.064982
C  5.886653 4.078512 2.785082
C  2.215219 -1.670109 1.218081
C  7.12319 3.437258 3.39883
C  -0.436343 -1.468873 0.599114
C  -2.55953 -1.195905 -0.320889
C  -2.406468 -0.160489 -1.258227
C  -1.127406 0.134905 -1.931127
C  -0.392555 -0.870108 -2.557229
C  -0.653225 1.445224 -1.948439
C  -3.78646 -1.404391 0.243371
C  0.802354 -0.563662 -3.19197
C  0.54593 1.744184 -2.574967
C  1.276149 0.740362 -3.198022
C  -4.791014 -0.538067 -0.175075
H  2.960875 1.702408 0.984547
H  3.384887 0.713759 2.366166
H  5.356245 2.345412 0.702397
H  5.792637 1.331952 2.061443
H  4.799615 -0.738162 0.911742
H  4.503605 0.318193 -0.449379
H  4.405604 2.731955 3.578702
H  3.854655 3.68756 2.22107
H  2.070362 -0.212998 -0.360738
H  3.094943 -1.58524 -0.726694
H  6.147812 4.52083 1.818288
H  5.565833 4.910581 3.418159
H  2.932494 -2.387511 1.622022
H  1.890027 -1.04167 2.046684
H  6.894037 2.972007 4.360345
H  7.905502 4.17805 3.572465
H  7.549947 2.66646 2.755353
H  -0.758771 -1.888704 -2.576274
H  -1.216991 2.228405 -1.45777
H  -3.959574 -2.183994 0.972801
H  1.362956 -1.348018 -3.683504
H  0.91069 2.763128 -2.575668
H  2.212029 0.975374 -3.688508
elementType: Cl S O N C H
totalener: -1856.33278692 hartree
nucrepener: 2429.46233753 hartree
electener: -4285.79512446 hartree
oneelecener: -7371.08578604 hartree
twoeener: 3085.29066158 hartree
cpcmener: -0.02514922 hartree
kineticenergy: 1850.60568209 hartree
xcener: -138.232591622800 hartree
chargesum: -0.0000000
charge: -0.046174 -0.047894 -0.285088 -0.374397 -0.141419 -0.195420 -0.109999 -0.123561 -0.118709 -0.109588 -0.122937 -0.113154 -0.107580 -0.277660 0.346522 0.173915 0.249759 0.022838 -0.160105 -0.171681 -0.138347 -0.193140 -0.165872 -0.120531 0.152334 0.060260 0.059582 0.058792 0.062795 0.070654 0.072811 0.061736 0.066153 0.030248 0.094143 0.054610 0.068506 0.129748 0.116659 0.080101 0.091201 0.079576 0.156014 0.140887 0.154168 0.154510 0.156118 0.158618
qa: -0.0462 -0.0479 -0.2851 -0.3744 -0.1414 -0.1954 -0.1100 -0.1236 -0.1187 -0.1096 -0.1229 -0.1132 -0.1076 -0.2777 0.3465 0.1739 0.2498 0.0228 -0.1601 -0.1717 -0.1383 -0.1931 -0.1659 -0.1205 0.1523 0.0603 0.0596 0.0588 0.0628 0.0707 0.0728 0.0617 0.0662 0.0302 0.0941 0.0546 0.0685 0.1297 0.1167 0.0801 0.0912 0.0796 0.1560 0.1409 0.1542 0.1545 0.1561 0.1586
va: 1.2564 2.4095 2.1193 2.1245 2.9514 2.9393 3.8815 3.8823 3.9152 3.8781 3.9194 3.8985 3.8902 3.9275 4.2829 3.8740 3.8199 3.5523 3.8553 3.9749 4.0446 3.8921 3.9126 3.8359 4.2101 1.0102 1.0111 1.0094 1.0064 1.0094 1.0120 1.0086 1.0119 1.0282 1.0133 1.0085 1.0077 1.0099 1.0251 1.0002 1.0047 0.9982 1.0077 1.0168 1.0065 0.9957 0.9930 0.9897
dispcorr: -0.024579965 hartree
energy: -1856.357366889948
dipole: 81.36423 -78.90864 2.45559 26.05659 -27.57469 -1.51810 15.95607 -15.37983 0.57624
magnitude: 2.94392 au
magnitude: 7.48284 debye
