program: Orca
programVersion: 5.0.2
elementType: Cl S O O N N C C C C C C C C C C C C C C C C C C C H H H H H H H H H H H H H H H H H H H H H H H
charge: 0
multiplicity: 1
keywords: wb97x-d3
keywords: def2-TZVPP
keywords: def2/J RIJCOSX
keywords: DEFGRID2
keywords: scfconv7
keywords: smallprint printgap noloewdin
keywords: NOSOSCF
formula: C19H23ClN2O2S
InChI: InChI=1/C19H23ClN2O2S/c1-2-3-4-5-6-10-13-25-19(23)24-16-14-17(20)21-22-18(16)15-11-8-7-9-12-15/h7-9,11-12,14H,2-6,10,13H2,1H3
48 atoms
Cl -6.517442 -1.131388 0.067071
S  0.725749 -2.796523 0.699373
O  -1.571158 -2.109585 -0.05565
O  -0.611458 -0.577948 1.286625
N  -3.474864 0.667483 -1.373763
N  -4.69114 0.34183 -1.008166
C  4.349953 1.050562 0.342232
C  5.513365 1.839295 0.937996
C  3.759927 -0.007121 1.268851
C  5.129429 2.703526 2.134334
C  2.631434 -0.778773 0.59593
C  6.288108 3.502801 2.726531
C  2.036816 -1.834667 1.511863
C  6.880387 4.541605 1.783749
C  -0.565493 -1.622698 0.710524
C  -2.615177 -1.284015 -0.355508
C  -2.437396 -0.102383 -1.093701
C  -1.12244 0.363474 -1.574534
C  -0.271886 -0.481536 -2.284726
C  -0.733261 1.678365 -1.326088
C  -3.875608 -1.641149 0.033433
C  0.952532 -0.012978 -2.738568
C  0.495707 2.13797 -1.771767
C  1.341147 1.293527 -2.479183
C  -4.889172 -0.769828 -0.348263
H  4.687531 0.561046 -0.576926
H  3.559284 1.745761 0.0387
H  5.936914 2.470098 0.151679
H  6.310535 1.14654 1.231131
H  3.379057 0.457339 2.18272
H  4.548418 -0.700453 1.580929
H  4.708103 2.073201 2.922248
H  4.32903 3.391831 1.838763
H  1.854764 -0.076508 0.28557
H  3.001405 -1.258292 -0.313984
H  5.937995 4.006337 3.63189
H  7.074378 2.81427 3.052056
H  2.783925 -2.58059 1.789522
H  1.644896 -1.412593 2.437704
H  7.34679 4.088563 0.907738
H  7.648188 5.13419 2.284126
H  6.11473 5.234317 1.42672
H  -0.569301 -1.497924 -2.510194
H  -1.388019 2.33711 -0.770053
H  -4.066761 -2.539315 0.604552
H  1.60346 -0.672704 -3.296885
H  0.79424 3.157581 -1.565096
H  2.300169 1.653978 -2.827945
elementType: Cl S O N C H
totalener: -1856.33262675 hartree
nucrepener: 2434.39147066 hartree
electener: -4290.72409741 hartree
oneelecener: -7380.89067247 hartree
twoeener: 3090.16657506 hartree
cpcmener: -0.02500500 hartree
kineticenergy: 1850.61516904 hartree
xcener: -138.235519909090 hartree
chargesum: 0.0000000
charge: -0.045780 -0.045170 -0.283183 -0.373379 -0.140347 -0.195641 -0.118802 -0.142760 -0.122525 -0.112991 -0.119250 -0.117333 -0.105313 -0.275421 0.342449 0.174331 0.252049 0.025661 -0.171259 -0.173792 -0.139763 -0.171380 -0.149915 -0.150228 0.153255 0.078410 0.054698 0.078063 0.062133 0.071719 0.067060 0.071183 0.062747 0.045391 0.077609 0.069080 0.054797 0.129387 0.116443 0.078818 0.090836 0.079087 0.155368 0.140324 0.153821 0.154286 0.156216 0.159013
qa: -0.0458 -0.0452 -0.2832 -0.3734 -0.1403 -0.1956 -0.1188 -0.1428 -0.1225 -0.1130 -0.1193 -0.1173 -0.1053 -0.2754 0.3424 0.1743 0.2520 0.0257 -0.1713 -0.1738 -0.1398 -0.1714 -0.1499 -0.1502 0.1533 0.0784 0.0547 0.0781 0.0621 0.0717 0.0671 0.0712 0.0627 0.0454 0.0776 0.0691 0.0548 0.1294 0.1164 0.0788 0.0908 0.0791 0.1554 0.1403 0.1538 0.1543 0.1562 0.1590
va: 1.2567 2.4096 2.1208 2.1277 2.9496 2.9392 3.9050 3.9162 3.9006 3.8638 3.8956 3.9015 3.9027 3.9284 4.2901 3.8763 3.8168 3.5434 3.8679 3.9780 4.0444 3.8694 3.8955 3.8454 4.2096 1.0069 1.0109 1.0091 1.0084 1.0079 1.0107 1.0135 1.0075 1.0243 1.0137 1.0060 1.0080 1.0093 1.0234 0.9990 1.0046 1.0003 1.0078 1.0167 1.0069 0.9956 0.9933 0.9897
dispcorr: -0.025181272 hartree
energy: -1856.357808020502
dipole: 83.39193 -80.89565 2.49628 29.37100 -30.87435 -1.50335 13.36370 -12.78226 0.58144
magnitude: 2.97146 au
magnitude: 7.55284 debye
