program: Orca
programVersion: 5.0.2
elementType: Cl S O O N N C C C C C C C C C C C C C C C C C C C H H H H H H H H H H H H H H H H H H H H H H H
charge: 0
multiplicity: 1
keywords: wb97x-d3
keywords: def2-TZVPP
keywords: def2/J RIJCOSX
keywords: DEFGRID2
keywords: scfconv7
keywords: smallprint printgap noloewdin
keywords: NOSOSCF
formula: C19H23ClN2O2S
InChI: InChI=1/C19H23ClN2O2S/c1-2-3-4-5-6-10-13-25-19(23)24-16-14-17(20)21-22-18(16)15-11-8-7-9-12-15/h7-9,11-12,14H,2-6,10,13H2,1H3
48 atoms
Cl -5.912233 -2.526132 -2.016655
S  0.240465 -1.783251 2.152374
O  -1.946168 -1.504034 0.93345
O  -0.182007 -1.587822 -0.460777
N  -3.50357 0.418865 -1.701507
N  -4.460993 -0.392616 -2.0831
C  4.075529 1.453179 0.459592
C  5.487729 1.681593 -0.0720
C  3.745499 0.001246 0.787494
C  6.593405 1.373759 0.932085
C  2.298664 -0.156541 1.239032
C  8.001825 1.644947 0.407902
C  1.949559 -1.599929 1.55721
C  8.294219 3.113979 0.136688
C  -0.624398 -1.605506 0.648323
C  -2.788485 -1.14274 -0.077507
C  -2.678273 0.102339 -0.718829
C  -1.652813 1.10345 -0.36807
C  -1.430346 1.475487 0.95673
C  -0.903152 1.696799 -1.382177
C  -3.786902 -1.99707 -0.451945
C  -0.466902 2.426419 1.259732
C  0.064772 2.639181 -1.073189
C  0.286465 3.004712 0.24819
C  -4.611646 -1.540734 -1.474301
H  3.357695 1.814025 -0.284192
H  3.919109 2.070964 1.351064
H  5.565877 2.72362 -0.394405
H  5.638556 1.076283 -0.973033
H  4.411591 -0.374802 1.569611
H  3.924756 -0.620945 -0.095903
H  6.532108 0.324514 1.234408
H  6.428112 1.959929 1.843643
H  2.123039 0.458382 2.12564
H  1.634976 0.223651 0.459095
H  8.726966 1.269258 1.135196
H  8.166155 1.064131 -0.505592
H  2.101618 -2.265214 0.706516
H  2.561852 -1.981887 2.376665
H  7.656399 3.526183 -0.646708
H  9.327511 3.257449 -0.1842
H  8.144111 3.718855 1.034028
H  -2.023882 1.049527 1.755735
H  -1.067572 1.40844 -2.412559
H  -3.917749 -2.966259 0.010115
H  -0.306538 2.714797 2.290289
H  0.649438 3.0870 -1.866317
H  1.043944 3.739823 0.487593
elementType: Cl S O N C H
totalener: -1856.33240654 hartree
nucrepener: 2427.24115094 hartree
electener: -4283.57355748 hartree
oneelecener: -7366.55603073 hartree
twoeener: 3082.98247325 hartree
cpcmener: -0.02497072 hartree
kineticenergy: 1850.60713007 hartree
xcener: -138.234162305104 hartree
chargesum: 0.0000000
charge: -0.046078 -0.044328 -0.284542 -0.373685 -0.141192 -0.196257 -0.117230 -0.144388 -0.122777 -0.111175 -0.118564 -0.115973 -0.104034 -0.274022 0.342327 0.169256 0.253365 0.029662 -0.174194 -0.169906 -0.138710 -0.171271 -0.154121 -0.149999 0.151535 0.066218 0.066636 0.078048 0.062032 0.069702 0.068383 0.071047 0.060678 0.077283 0.046214 0.068378 0.053797 0.116599 0.130041 0.079127 0.090441 0.078382 0.156079 0.140742 0.154876 0.155322 0.156845 0.159432
qa: -0.0461 -0.0443 -0.2845 -0.3737 -0.1412 -0.1963 -0.1172 -0.1444 -0.1228 -0.1112 -0.1186 -0.1160 -0.1040 -0.2740 0.3423 0.1693 0.2534 0.0297 -0.1742 -0.1699 -0.1387 -0.1713 -0.1541 -0.1500 0.1515 0.0662 0.0666 0.0780 0.0620 0.0697 0.0684 0.0710 0.0607 0.0773 0.0462 0.0684 0.0538 0.1166 0.1300 0.0791 0.0904 0.0784 0.1561 0.1407 0.1549 0.1553 0.1568 0.1594
va: 1.2561 2.4093 2.1191 2.1272 2.9487 2.9382 3.8984 3.9186 3.9055 3.8654 3.8982 3.9053 3.9011 3.9279 4.2909 3.8801 3.8163 3.5402 3.8691 3.9781 4.0435 3.8685 3.8952 3.8435 4.2099 1.0130 1.0075 1.0092 1.0083 1.0104 1.0087 1.0129 1.0081 1.0122 1.0248 1.0058 1.0082 1.0239 1.0090 0.9995 1.0045 1.0005 1.0080 1.0172 1.0062 0.9952 0.9933 0.9895
dispcorr: -0.025253024 hartree
energy: -1856.357659566829
dipole: 87.20681 -85.14138 2.06543 29.20638 -29.69377 -0.48739 12.99947 -10.90075 2.09872
magnitude: 2.98465 au
magnitude: 7.58638 debye
