program: Orca
programVersion: 5.0.2
elementType: Cl S O O N N C C C C C C C C C C C C C C C C C C C H H H H H H H H H H H H H H H H H H H H H H H
charge: 0
multiplicity: 1
keywords: wb97x-d3
keywords: def2-TZVPP
keywords: def2/J RIJCOSX
keywords: DEFGRID2
keywords: scfconv7
keywords: smallprint printgap noloewdin
keywords: NOSOSCF
formula: C19H23ClN2O2S
InChI: InChI=1/C19H23ClN2O2S/c1-2-3-4-5-6-10-13-25-19(23)24-16-14-17(20)21-22-18(16)15-11-8-7-9-12-15/h7-9,11-12,14H,2-6,10,13H2,1H3
48 atoms
Cl -6.587382 -1.376207 -0.060598
S  0.731885 -2.608242 0.762151
O  -1.591981 -2.098024 -0.065331
O  -0.805206 -0.522632 1.333942
N  -3.606908 0.573191 -1.436598
N  -4.813684 0.185794 -1.100124
C  4.037296 1.529854 0.61471
C  4.988313 2.499644 1.310573
C  3.496012 0.4160 1.504635
C  6.298598 1.871365 1.773051
C  2.473455 -0.442926 0.769724
C  7.257965 2.853152 2.442386
C  1.920148 -1.553373 1.646375
C  7.778561 3.948337 1.521575
C  -0.652842 -1.548784 0.743659
C  -2.672992 -1.333294 -0.396515
C  -2.538306 -0.142025 -1.128782
C  -1.236031 0.395773 -1.568153
C  -0.312546 -0.401212 -2.242305
C  -0.93275 1.732504 -1.315316
C  -3.922903 -1.756468 -0.040154
C  0.898447 0.135597 -2.655581
C  0.282682 2.2608 -1.720368
C  1.201335 1.463547 -2.390988
C  -4.970006 -0.935651 -0.44402
H  4.540391 1.088724 -0.252945
H  3.190727 2.097206 0.214279
H  4.480178 2.952801 2.169549
H  5.201038 3.320792 0.62035
H  3.032442 0.854474 2.394926
H  4.312513 -0.21818 1.862226
H  6.798383 1.405327 0.91582
H  6.088159 1.06025 2.475939
H  1.657987 0.19278 0.41662
H  2.933723 -0.883406 -0.118837
H  6.764587 3.307588 3.307672
H  8.108347 2.293797 2.842382
H  2.710403 -2.239995 1.956547
H  1.449874 -1.17471 2.554267
H  6.981631 4.601247 1.162707
H  8.277292 3.526773 0.645935
H  8.503954 4.58175 2.034984
H  -0.541228 -1.433995 -2.472819
H  -1.643649 2.356029 -0.788471
H  -4.080106 -2.664832 0.525658
H  1.60629 -0.488024 -3.185874
H  0.51299 3.297341 -1.510606
H  2.150258 1.87734 -2.707197
elementType: Cl S O N C H
totalener: -1856.33261721 hartree
nucrepener: 2425.59184932 hartree
electener: -4281.92446653 hartree
oneelecener: -7363.26493297 hartree
twoeener: 3081.34046644 hartree
cpcmener: -0.02487443 hartree
kineticenergy: 1850.60181030 hartree
xcener: -138.232899381705 hartree
chargesum: -0.0000000
charge: -0.046038 -0.044359 -0.284394 -0.373258 -0.140357 -0.196100 -0.116084 -0.143450 -0.122881 -0.110960 -0.115741 -0.115303 -0.103992 -0.275220 0.341735 0.168438 0.253499 0.027148 -0.172822 -0.172875 -0.136738 -0.170314 -0.151246 -0.151109 0.153449 0.066290 0.065586 0.061972 0.077380 0.067653 0.069574 0.060738 0.070476 0.044034 0.077208 0.053571 0.068751 0.130169 0.115804 0.079336 0.078668 0.090773 0.154916 0.141339 0.154091 0.155117 0.155986 0.159541
qa: -0.0460 -0.0444 -0.2844 -0.3733 -0.1404 -0.1961 -0.1161 -0.1435 -0.1229 -0.1110 -0.1157 -0.1153 -0.1040 -0.2752 0.3417 0.1684 0.2535 0.0271 -0.1728 -0.1729 -0.1367 -0.1703 -0.1512 -0.1511 0.1534 0.0663 0.0656 0.0620 0.0774 0.0677 0.0696 0.0607 0.0705 0.0440 0.0772 0.0536 0.0688 0.1302 0.1158 0.0793 0.0787 0.0908 0.1549 0.1413 0.1541 0.1551 0.1560 0.1595
va: 1.2563 2.4102 2.1196 2.1270 2.9501 2.9384 3.8991 3.9172 3.9068 3.8665 3.8993 3.9041 3.9009 3.9286 4.2917 3.8815 3.8166 3.5433 3.8711 3.9760 4.0443 3.8675 3.8917 3.8438 4.2080 1.0078 1.0127 1.0081 1.0094 1.0089 1.0101 1.0080 1.0134 1.0256 1.0124 1.0082 1.0058 1.0090 1.0242 0.9992 1.0005 1.0045 1.0083 1.0165 1.0065 0.9952 0.9934 0.9896
dispcorr: -0.025170344 hartree
energy: -1856.357787556153
dipole: 86.73136 -84.15581 2.57555 29.85443 -31.19418 -1.33975 14.01899 -13.36587 0.65312
magnitude: 2.97573 au
magnitude: 7.56370 debye
