program: Orca
programVersion: 5.0.2
elementType: Cl S O O N N C C C C C C C C C C C C C C C C C C C H H H H H H H H H H H H H H H H H H H H H H H
charge: 0
multiplicity: 1
keywords: wb97x-d3
keywords: def2-TZVPP
keywords: def2/J RIJCOSX
keywords: DEFGRID2
keywords: scfconv7
keywords: smallprint printgap noloewdin
keywords: NOSOSCF
formula: C19H23ClN2O2S
InChI: InChI=1/C19H23ClN2O2S/c1-2-3-4-5-6-10-13-25-19(23)24-16-14-17(20)21-22-18(16)15-11-8-7-9-12-15/h7-9,11-12,14H,2-6,10,13H2,1H3
48 atoms
Cl -5.862501 -0.19648 0.931785
S  0.955904 -3.092456 0.447199
O  -1.237206 -1.960478 -0.018849
O  0.180271 -0.643982 1.130749
N  -2.848025 1.132659 -0.994753
N  -4.024866 0.996186 -0.434219
C  4.451588 0.086308 1.372941
C  3.618642 1.243869 0.835376
C  4.600769 -1.075269 0.391953
C  3.59628 2.451387 1.763423
C  3.29009 -1.70093 -0.078822
C  2.693235 3.570739 1.261402
C  2.537828 -2.414342 1.033069
C  2.674543 4.781452 2.181455
C  -0.059853 -1.680507 0.589556
C  -2.160691 -0.962691 -0.14371
C  -1.915005 0.199972 -0.892978
C  -0.639622 0.475246 -1.580664
C  -0.025375 -0.483894 -2.383685
C  -0.048434 1.729454 -1.436561
C  -3.383666 -1.125221 0.446157
C  1.169926 -0.191517 -3.024479
C  1.148096 2.014242 -2.074455
C  1.762326 1.053307 -2.866782
C  -4.289113 -0.089617 0.247578
H  4.020497 -0.264958 2.316059
H  5.452711 0.450486 1.62427
H  2.589535 0.914496 0.665951
H  4.005093 1.545018 -0.145199
H  5.232108 -1.850043 0.838124
H  5.139184 -0.721513 -0.492313
H  4.614526 2.834562 1.893034
H  3.261215 2.138042 2.758617
H  2.651295 -0.937197 -0.527065
H  3.502929 -2.421179 -0.872264
H  3.017289 3.878604 0.261917
H  1.675093 3.185696 1.144555
H  3.098343 -3.279467 1.392404
H  2.34221 -1.781613 1.897775
H  3.669719 5.218661 2.285237
H  2.327751 4.51557 3.182136
H  2.012408 5.56197 1.803165
H  -0.484887 -1.451983 -2.537232
H  -0.518242 2.479342 -0.81341
H  -3.622239 -2.001624 1.033661
H  1.636689 -0.940316 -3.65078
H  1.604049 2.987579 -1.948454
H  2.698768 1.276354 -3.361625
elementType: Cl S O N C H
totalener: -1856.33264923 hartree
nucrepener: 2534.06944669 hartree
electener: -4390.40209591 hartree
oneelecener: -7580.46452353 hartree
twoeener: 3190.06242762 hartree
cpcmener: -0.02461461 hartree
kineticenergy: 1850.60894653 hartree
xcener: -138.235222986509 hartree
chargesum: -0.0000000
charge: -0.045890 -0.047607 -0.283964 -0.377214 -0.141155 -0.197716 -0.137486 -0.060151 -0.153462 -0.126360 -0.095309 -0.065710 -0.108151 -0.287791 0.352741 0.168116 0.253991 0.023883 -0.161888 -0.152920 -0.134815 -0.192439 -0.211638 -0.093391 0.153462 0.066560 0.073293 0.021076 0.062572 0.080868 0.078733 0.059188 0.056531 0.006628 0.097860 0.051547 0.050890 0.132532 0.115551 0.078625 0.078103 0.089880 0.156903 0.141583 0.152499 0.154462 0.158425 0.158554
qa: -0.0459 -0.0476 -0.2840 -0.3772 -0.1412 -0.1977 -0.1375 -0.0602 -0.1535 -0.1264 -0.0953 -0.0657 -0.1082 -0.2878 0.3527 0.1681 0.2540 0.0239 -0.1619 -0.1529 -0.1348 -0.1924 -0.2116 -0.0934 0.1535 0.0666 0.0733 0.0211 0.0626 0.0809 0.0787 0.0592 0.0565 0.0066 0.0979 0.0515 0.0509 0.1325 0.1156 0.0786 0.0781 0.0899 0.1569 0.1416 0.1525 0.1545 0.1584 0.1586
va: 1.2567 2.4118 2.1204 2.1166 2.9485 2.9394 3.9017 3.8433 3.9429 3.9006 3.8927 3.8685 3.8735 3.9679 4.2714 3.8833 3.8104 3.5653 3.8454 3.9190 4.0435 3.8866 3.9087 3.8024 4.2088 1.0049 1.0124 1.0101 1.0099 1.0084 1.0089 1.0098 1.0078 1.0270 1.0160 1.0055 1.0079 1.0089 1.0256 1.0006 1.0005 1.0036 1.0076 1.0189 1.0074 0.9950 0.9922 0.9894
dispcorr: -0.027730317 hartree
energy: -1856.360379542504
dipole: 64.08901 -61.85077 2.23824 20.43907 -22.38638 -1.94732 6.86690 -6.71051 0.15639
magnitude: 2.97089 au
magnitude: 7.55141 debye
