program: Orca
programVersion: 5.0.2
elementType: Cl S O O N N C C C C C C C C C C C C C C C C C C C H H H H H H H H H H H H H H H H H H H H H H H
charge: 0
multiplicity: 1
keywords: wb97x-d3
keywords: def2-TZVPP
keywords: def2/J RIJCOSX
keywords: DEFGRID2
keywords: scfconv7
keywords: smallprint printgap noloewdin
keywords: NOSOSCF
formula: C19H23ClN2O2S
InChI: InChI=1/C19H23ClN2O2S/c1-2-3-4-5-6-10-13-25-19(23)24-16-14-17(20)21-22-18(16)15-11-8-7-9-12-15/h7-9,11-12,14H,2-6,10,13H2,1H3
48 atoms
Cl -6.100524 -1.185235 0.274336
S  1.126325 -2.63527 0.532243
O  -1.119001 -1.819673 -0.225566
O  -0.316007 -0.620935 1.500626
N  -3.224588 1.049395 -0.869471
N  -4.404583 0.582943 -0.539573
C  3.663549 0.112433 0.250627
C  4.271223 0.888679 1.41373
C  4.06833 -1.356974 0.185287
C  3.914434 2.373886 1.407331
C  3.706548 -2.190824 1.410971
C  4.560994 3.172917 0.281175
C  2.255148 -2.089991 1.856532
C  4.157882 4.639606 0.295338
C  -0.190554 -1.508152 0.711023
C  -2.219961 -1.017272 -0.320988
C  -2.135299 0.302764 -0.7888
C  -0.868697 0.94622 -1.185125
C  -0.584151 2.225914 -0.711688
C  0.030433 0.317866 -2.04588
C  -3.442242 -1.525492 0.019772
C  0.585452 2.866079 -1.089134
C  1.19445 0.967838 -2.42957
C  1.475315 2.240527 -1.952311
C  -4.515286 -0.653659 -0.12514
H  3.953285 0.577048 -0.695481
H  2.571962 0.199355 0.293908
H  5.361488 0.775023 1.403263
H  3.933685 0.453249 2.359226
H  5.149782 -1.428206 0.03608
H  3.617404 -1.804308 -0.70511
H  4.211012 2.817007 2.363427
H  2.824798 2.481544 1.353108
H  3.969121 -3.236149 1.229195
H  4.308193 -1.882408 2.270128
H  5.649684 3.091605 0.363275
H  4.299615 2.740862 -0.68862
H  2.076149 -2.719208 2.727913
H  1.992172 -1.06805 2.126301
H  3.079034 4.756129 0.169202
H  4.64259 5.197395 -0.507706
H  4.429695 5.120151 1.237712
H  -1.274575 2.71717 -0.038113
H  -0.184524 -0.664883 -2.446212
H  -3.559475 -2.535423 0.388965
H  0.800658 3.856807 -0.709798
H  1.88154 0.477472 -3.106724
H  2.385948 2.74405 -2.250642
elementType: Cl S O N C H
totalener: -1856.32946661 hartree
nucrepener: 2526.43444324 hartree
electener: -4382.76390985 hartree
oneelecener: -7564.99142943 hartree
twoeener: 3182.22751957 hartree
cpcmener: -0.02528154 hartree
kineticenergy: 1850.60310222 hartree
xcener: -138.236693108498 hartree
chargesum: 0.0000000
charge: -0.045543 -0.043748 -0.288095 -0.382505 -0.142713 -0.194846 -0.071562 -0.142604 -0.175747 -0.122373 -0.156042 -0.109935 -0.123792 -0.276243 0.362688 0.163678 0.257922 0.023826 -0.157896 -0.178686 -0.130755 -0.187856 -0.173330 -0.138162 0.152113 0.083233 0.016375 0.066226 0.076662 0.079714 0.083168 0.080345 0.057082 0.098080 0.089600 0.067361 0.055929 0.131855 0.109752 0.072061 0.090675 0.083328 0.141309 0.154796 0.154361 0.166216 0.154655 0.169421
qa: -0.0455 -0.0437 -0.2881 -0.3825 -0.1427 -0.1948 -0.0716 -0.1426 -0.1757 -0.1224 -0.1560 -0.1099 -0.1238 -0.2762 0.3627 0.1637 0.2579 0.0238 -0.1579 -0.1787 -0.1308 -0.1879 -0.1733 -0.1382 0.1521 0.0832 0.0164 0.0662 0.0767 0.0797 0.0832 0.0803 0.0571 0.0981 0.0896 0.0674 0.0559 0.1319 0.1098 0.0721 0.0907 0.0833 0.1413 0.1548 0.1544 0.1662 0.1547 0.1694
va: 1.2570 2.4259 2.1130 2.1174 2.9498 2.9375 3.8355 3.9047 3.9110 3.8708 3.8825 3.8678 3.9149 3.9374 4.2744 3.8792 3.8057 3.5653 3.9881 3.8711 4.0500 3.8984 3.8781 3.8196 4.2070 1.0052 1.0091 1.0110 1.0060 1.0120 1.0106 1.0100 1.0122 1.0103 1.0024 1.0108 1.0068 1.0068 1.0205 1.0032 1.0040 1.0025 1.0182 1.0077 1.0060 0.9870 0.9962 0.9821
dispcorr: -0.027917473 hartree
energy: -1856.357384085490
dipole: 70.33727 -67.73480 2.60247 22.43344 -24.10349 -1.67005 6.31185 -5.98104 0.33080
magnitude: 3.10988 au
magnitude: 7.90469 debye
