program: Orca
programVersion: 5.0.2
elementType: Cl S O O N N C C C C C C C C C C C C C C C C C C C H H H H H H H H H H H H H H H H H H H H H H H
charge: 0
multiplicity: 1
keywords: wb97x-d3
keywords: def2-TZVPP
keywords: def2/J RIJCOSX
keywords: DEFGRID2
keywords: scfconv7
keywords: smallprint printgap noloewdin
keywords: NOSOSCF
formula: C19H23ClN2O2S
InChI: InChI=1/C19H23ClN2O2S/c1-2-3-4-5-6-10-13-25-19(23)24-16-14-17(20)21-22-18(16)15-11-8-7-9-12-15/h7-9,11-12,14H,2-6,10,13H2,1H3
48 atoms
Cl -6.119977 -1.66395 -0.398113
S  1.004037 -1.998753 1.319228
O  -1.099048 -1.499025 0.056974
O  -0.792406 -0.088825 1.783774
N  -3.455987 0.966019 -1.151643
N  -4.591936 0.325941 -1.009262
C  3.839834 1.80001 1.27446
C  5.069343 1.156294 0.637613
C  2.655807 0.863129 1.50557
C  4.81674 0.553965 -0.739531
C  3.004381 -0.34756 2.358542
C  6.076422 0.030836 -1.425294
C  1.81661 -1.211168 2.746635
C  6.724209 -1.150613 -0.717872
C  -0.419314 -1.010051 1.122625
C  -2.270436 -0.887509 -0.289166
C  -2.301373 0.408279 -0.825612
C  -1.089675 1.220583 -1.041997
C  0.009354 0.704906 -1.726033
C  -1.056555 2.534421 -0.579406
C  -3.443033 -1.573235 -0.136364
C  1.12424 1.500123 -1.948894
C  0.065616 3.319593 -0.791479
C  1.157193 2.805274 -1.478508
C  -4.588886 -0.893624 -0.534093
H  3.506562 2.633768 0.647977
H  4.131937 2.243628 2.231755
H  5.476577 0.396423 1.310726
H  5.851122 1.918499 0.55085
H  2.252484 0.532561 0.5443
H  1.853014 1.428796 1.9881
H  4.356466 1.315739 -1.378247
H  4.086761 -0.259927 -0.667693
H  3.746933 -0.971367 1.854042
H  3.470595 -0.018718 3.293444
H  5.826169 -0.263289 -2.448515
H  6.803002 0.84465 -1.515705
H  2.135354 -2.03775 3.382724
H  1.064534 -0.650232 3.301402
H  7.074731 -0.892252 0.282431
H  7.587706 -1.517822 -1.275287
H  6.024336 -1.98319 -0.616045
H  -0.009391 -0.304507 -2.116806
H  -1.90472 2.939337 -0.042455
H  -3.472973 -2.573997 0.273233
H  1.967679 1.097989 -2.494693
H  0.086463 4.33607 -0.420627
H  2.029699 3.422538 -1.649438
elementType: Cl S O N C H
totalener: -1856.33060220 hartree
nucrepener: 2506.50558955 hartree
electener: -4362.83619175 hartree
oneelecener: -7525.13096979 hartree
twoeener: 3162.29477804 hartree
cpcmener: -0.02535699 hartree
kineticenergy: 1850.60400024 hartree
xcener: -138.235595252558 hartree
chargesum: 0.0000000
charge: -0.045878 -0.048237 -0.288897 -0.379479 -0.143737 -0.194664 -0.178171 -0.125366 -0.084994 -0.116019 -0.133597 -0.108965 -0.123093 -0.274894 0.355885 0.172752 0.245629 0.033871 -0.163365 -0.179557 -0.132186 -0.185484 -0.153777 -0.136926 0.151431 0.078093 0.083619 0.069256 0.077943 0.011158 0.087456 0.064405 0.059574 0.076901 0.085219 0.067844 0.053744 0.131584 0.116821 0.079903 0.092446 0.077949 0.152503 0.141007 0.153996 0.158935 0.156109 0.161253
qa: -0.0459 -0.0482 -0.2889 -0.3795 -0.1437 -0.1947 -0.1782 -0.1254 -0.0850 -0.1160 -0.1336 -0.1090 -0.1231 -0.2749 0.3559 0.1728 0.2456 0.0339 -0.1634 -0.1796 -0.1322 -0.1855 -0.1538 -0.1369 0.1514 0.0781 0.0836 0.0693 0.0779 0.0112 0.0875 0.0644 0.0596 0.0769 0.0852 0.0678 0.0537 0.1316 0.1168 0.0799 0.0924 0.0779 0.1525 0.1410 0.1540 0.1589 0.1561 0.1613
va: 1.2565 2.4031 2.1149 2.1201 2.9528 2.9402 3.9332 3.8471 3.8208 3.8668 3.9051 3.9101 3.8955 3.9274 4.2745 3.8606 3.8124 3.5606 3.8654 3.9857 4.0534 3.8554 3.9208 3.8313 4.2087 1.0081 1.0077 1.0002 1.0106 1.0289 1.0157 1.0145 1.0036 1.0067 1.0115 1.0066 1.0093 1.0082 1.0297 0.9987 1.0052 1.0012 1.0087 1.0164 1.0065 0.9921 0.9931 0.9899
dispcorr: -0.027359443 hartree
energy: -1856.357961639727
dipole: 77.41777 -74.79334 2.62443 13.22751 -14.42327 -1.19576 5.16382 -4.25475 0.90907
magnitude: 3.02388 au
magnitude: 7.68610 debye
