program: Orca
programVersion: 5.0.2
elementType: Cl S O O N N C C C C C C C C C C C C C C C C C C C H H H H H H H H H H H H H H H H H H H H H H H
charge: 0
multiplicity: 1
keywords: wb97x-d3
keywords: def2-TZVPP
keywords: def2/J RIJCOSX
keywords: DEFGRID2
keywords: scfconv7
keywords: smallprint printgap noloewdin
keywords: NOSOSCF
formula: C19H23ClN2O2S
InChI: InChI=1/C19H23ClN2O2S/c1-2-3-4-5-6-10-13-25-19(23)24-16-14-17(20)21-22-18(16)15-11-8-7-9-12-15/h7-9,11-12,14H,2-6,10,13H2,1H3
48 atoms
Cl -5.802114 -0.159634 1.060955
S  0.994868 -3.090169 0.351056
O  -1.221285 -1.964822 -0.03259
O  0.198955 -0.68487 1.151299
N  -2.817888 1.159605 -0.918431
N  -3.9824 1.028854 -0.331257
C  4.364889 0.118617 1.49125
C  3.488138 1.284401 1.049039
C  4.57042 -0.949538 0.417668
C  3.290825 2.327709 2.142137
C  3.289881 -1.601595 -0.09899
C  2.348456 3.461502 1.747703
C  2.567259 -2.412931 0.965134
C  2.9020 4.38005 0.666863
C  -0.037968 -1.699459 0.567878
C  -2.141176 -0.959096 -0.11852
C  -1.896543 0.212991 -0.853511
C  -0.629872 0.483688 -1.558471
C  -0.044913 -0.467176 -2.39294
C  -0.018311 1.726253 -1.398869
C  -3.35091 -1.115853 0.497347
C  1.141242 -0.17721 -3.051342
C  1.169421 2.008323 -2.05398
C  1.753694 1.056006 -2.878937
C  -4.246391 -0.064208 0.337356
H  3.942685 -0.331739 2.395592
H  5.346877 0.502362 1.785667
H  2.503155 0.918692 0.745377
H  3.927943 1.742869 0.157243
H  5.240754 -1.724461 0.802585
H  5.088443 -0.502057 -0.435911
H  4.259874 2.744038 2.439515
H  2.890615 1.82861 3.030569
H  2.620623 -0.838507 -0.501561
H  3.533319 -2.260394 -0.93578
H  1.395713 3.034752 1.416767
H  2.117851 4.05899 2.634091
H  3.152852 -3.285789 1.259596
H  2.361655 -1.847212 1.873302
H  3.820314 4.869402 0.998711
H  2.188091 5.164722 0.410653
H  3.134233 3.842729 -0.253763
H  -0.521399 -1.425611 -2.555514
H  -0.46788 2.467763 -0.750924
H  -3.588485 -1.996151 1.079164
H  1.585581 -0.918644 -3.702387
H  1.640174 2.973347 -1.917618
H  2.68226 1.277014 -3.389304
elementType: Cl S O N C H
totalener: -1856.33134768 hartree
nucrepener: 2554.51853746 hartree
electener: -4410.84988514 hartree
oneelecener: -7621.35483309 hartree
twoeener: 3210.50494795 hartree
cpcmener: -0.02458950 hartree
kineticenergy: 1850.61159839 hartree
xcener: -138.237404534760 hartree
chargesum: 0.0000000
charge: -0.045549 -0.047764 -0.284560 -0.379020 -0.141726 -0.196951 -0.144679 -0.080993 -0.146206 -0.113535 -0.093655 -0.110720 -0.107333 -0.280628 0.353951 0.163866 0.256307 0.028360 -0.161077 -0.159685 -0.132300 -0.195933 -0.219045 -0.088769 0.152890 0.066381 0.076483 0.013629 0.070287 0.080662 0.077223 0.062162 0.068667 0.001424 0.098496 0.052280 0.074626 0.133805 0.115730 0.087287 0.094509 0.068407 0.156303 0.140811 0.152286 0.154319 0.171339 0.157639
qa: -0.0455 -0.0478 -0.2846 -0.3790 -0.1417 -0.1970 -0.1447 -0.0810 -0.1462 -0.1135 -0.0937 -0.1107 -0.1073 -0.2806 0.3540 0.1639 0.2563 0.0284 -0.1611 -0.1597 -0.1323 -0.1959 -0.2190 -0.0888 0.1529 0.0664 0.0765 0.0136 0.0703 0.0807 0.0772 0.0622 0.0687 0.0014 0.0985 0.0523 0.0746 0.1338 0.1157 0.0873 0.0945 0.0684 0.1563 0.1408 0.1523 0.1543 0.1713 0.1576
va: 1.2572 2.4113 2.1207 2.1131 2.9488 2.9396 3.9096 3.8451 3.9389 3.8868 3.8926 3.8911 3.8740 3.9227 4.2690 3.8888 3.8106 3.5624 3.8479 3.9222 4.0451 3.8951 3.9025 3.8137 4.2096 1.0051 1.0115 1.0100 1.0057 1.0082 1.0100 1.0101 1.0106 1.0254 1.0157 1.0110 1.0091 1.0084 1.0256 1.0036 1.0028 1.0017 1.0081 1.0194 1.0073 0.9952 0.9836 0.9900
dispcorr: -0.028656067 hartree
energy: -1856.360003746212
dipole: 63.11756 -60.91747 2.20009 19.56127 -21.49989 -1.93863 4.67029 -4.55574 0.11455
magnitude: 2.93459 au
magnitude: 7.45913 debye
