program: Orca
programVersion: 5.0.2
elementType: Cl S O O N N C C C C C C C C C C C C C C C C C C C H H H H H H H H H H H H H H H H H H H H H H H
charge: 0
multiplicity: 1
keywords: wb97x-d3
keywords: def2-TZVPP
keywords: def2/J RIJCOSX
keywords: DEFGRID2
keywords: scfconv7
keywords: smallprint printgap noloewdin
keywords: NOSOSCF
formula: C19H23ClN2O2S
InChI: InChI=1/C19H23ClN2O2S/c1-2-3-4-5-6-10-13-25-19(23)24-16-14-17(20)21-22-18(16)15-11-8-7-9-12-15/h7-9,11-12,14H,2-6,10,13H2,1H3
48 atoms
Cl -6.205266 -0.787717 0.473467
S  0.899936 -2.923899 0.469076
O  -1.341477 -1.968458 -0.101216
O  -0.19502 -0.660104 1.331492
N  -3.175404 1.026849 -0.975237
N  -4.379624 0.719374 -0.559621
C  5.290533 0.09995 0.581523
C  4.742454 1.515997 0.420566
C  4.397823 -0.867316 1.354983
C  4.522213 2.238117 1.747123
C  3.098598 -1.209005 0.632216
C  4.320936 3.744241 1.610939
C  2.308905 -2.256771 1.398884
C  3.115644 4.133613 0.768442
C  -0.266457 -1.642567 0.657476
C  -2.350536 -1.061136 -0.239545
C  -2.160508 0.185726 -0.857137
C  -0.861666 0.650012 -1.379024
C  -0.452223 1.954738 -1.109052
C  -0.047698 -0.175464 -2.153697
C  -3.601019 -1.403245 0.195118
C  0.758559 2.421628 -1.593681
C  1.165649 0.295934 -2.633756
C  1.574239 1.591783 -2.352015
C  -4.591129 -0.450803 -0.012236
H  6.26013 0.158745 1.086244
H  5.492989 -0.322688 -0.407991
H  3.813087 1.495744 -0.156941
H  5.454387 2.088775 -0.183732
H  4.175912 -0.466927 2.348777
H  4.956235 -1.793283 1.524556
H  5.385937 2.057999 2.396471
H  3.659701 1.80876 2.267234
H  2.486915 -0.314767 0.492227
H  3.330699 -1.590597 -0.366006
H  4.215422 4.177491 2.609596
H  5.223199 4.192041 1.1818
H  2.925888 -3.136085 1.597148
H  1.957723 -1.890999 2.364382
H  2.200666 3.670332 1.14462
H  3.234102 3.831571 -0.273113
H  2.962469 5.214189 0.774122
H  -1.077228 2.602857 -0.508381
H  -0.362972 -1.177935 -2.412997
H  -3.799704 -2.352832 0.673378
H  1.066121 3.436029 -1.376805
H  1.78836 -0.351525 -3.237279
H  2.521319 1.956896 -2.728035
elementType: Cl S O N C H
totalener: -1856.33165875 hartree
nucrepener: 2498.76404805 hartree
electener: -4355.09570681 hartree
oneelecener: -7509.70043893 hartree
twoeener: 3154.60473212 hartree
cpcmener: -0.02479993 hartree
kineticenergy: 1850.60702234 hartree
xcener: -138.235119070903 hartree
chargesum: 0.0000000
charge: -0.045579 -0.042925 -0.284303 -0.376844 -0.140239 -0.197564 -0.146643 -0.105221 -0.154526 -0.114093 -0.116565 -0.114713 -0.106612 -0.275018 0.342525 0.174534 0.250081 0.018489 -0.161793 -0.164179 -0.137876 -0.178937 -0.187599 -0.128713 0.152339 0.075904 0.073616 0.028245 0.077123 0.078798 0.084763 0.071377 0.064463 0.063743 0.071239 0.066894 0.053949 0.127259 0.119329 0.081015 0.071442 0.096868 0.137909 0.159831 0.153577 0.172566 0.153346 0.158717
qa: -0.0456 -0.0429 -0.2843 -0.3768 -0.1402 -0.1976 -0.1466 -0.1052 -0.1545 -0.1141 -0.1166 -0.1147 -0.1066 -0.2750 0.3425 0.1745 0.2501 0.0185 -0.1618 -0.1642 -0.1379 -0.1789 -0.1876 -0.1287 0.1523 0.0759 0.0736 0.0282 0.0771 0.0788 0.0848 0.0714 0.0645 0.0637 0.0712 0.0669 0.0539 0.1273 0.1193 0.0810 0.0714 0.0969 0.1379 0.1598 0.1536 0.1726 0.1533 0.1587
va: 1.2569 2.4141 2.1167 2.1223 2.9474 2.9391 3.9215 3.8647 3.9087 3.8541 3.8612 3.9220 3.8910 3.9316 4.2908 3.8768 3.8269 3.5520 3.9902 3.8505 4.0421 3.9086 3.9024 3.8452 4.2075 1.0078 1.0096 1.0102 1.0111 1.0035 1.0095 1.0110 1.0048 1.0155 1.0172 1.0079 1.0088 1.0099 1.0222 0.9975 0.9981 1.0061 1.0220 1.0058 1.0071 0.9783 0.9962 0.9913
dispcorr: -0.026715306 hartree
energy: -1856.358374060426
dipole: 71.98487 -69.52179 2.46308 22.88563 -24.62508 -1.73944 7.44891 -7.14704 0.30187
magnitude: 3.03044 au
magnitude: 7.70276 debye
