program: Orca
programVersion: 5.0.2
elementType: Cl S O O N N C C C C C C C C C C C C C C C C C C C H H H H H H H H H H H H H H H H H H H H H H H
charge: 0
multiplicity: 1
keywords: wb97x-d3
keywords: def2-TZVPP
keywords: def2/J RIJCOSX
keywords: DEFGRID2
keywords: scfconv7
keywords: smallprint printgap noloewdin
keywords: NOSOSCF
formula: C19H23ClN2O2S
InChI: InChI=1/C19H23ClN2O2S/c1-2-3-4-5-6-10-13-25-19(23)24-16-14-17(20)21-22-18(16)15-11-8-7-9-12-15/h7-9,11-12,14H,2-6,10,13H2,1H3
48 atoms
Cl -6.324193 -1.485334 -0.160058
S  0.952812 -2.785813 0.210878
O  -1.307983 -1.895061 -0.402765
O  -0.489305 -0.940733 1.466715
N  -3.46429 1.007226 -0.580966
N  -4.645153 0.456057 -0.440303
C  4.913175 0.492976 1.562986
C  4.222786 1.802256 1.200046
C  3.962429 -0.59079 2.065107
C  5.184155 2.926626 0.823004
C  2.914143 -0.993788 1.03239
C  6.067154 2.648019 -0.391983
C  2.1615 -2.243907 1.454237
C  5.29021 2.381695 -1.673102
C  -0.370641 -1.705079 0.55778
C  -2.419781 -1.104588 -0.4006
C  -2.355038 0.285748 -0.585753
C  -1.095156 1.027131 -0.780479
C  -0.87497 2.197245 -0.056113
C  -0.136633 0.597424 -1.69652
C  -3.642965 -1.699332 -0.259236
C  0.290933 2.922965 -0.239433
C  1.025773 1.331787 -1.881966
C  1.243259 2.493021 -1.153925
C  -4.735807 -0.842375 -0.302418
H  5.667126 0.68688 2.332962
H  5.459224 0.104593 0.697192
H  3.617354 2.13242 2.051025
H  3.513877 1.636644 0.384139
H  3.464249 -0.253638 2.979803
H  4.549606 -1.471467 2.344114
H  5.82478 3.151267 1.68212
H  4.604216 3.836521 0.635499
H  2.207752 -0.176109 0.872985
H  3.400657 -1.179143 0.070076
H  6.724004 3.5088 -0.545917
H  6.731823 1.803928 -0.187459
H  2.841418 -3.092174 1.556245
H  1.653948 -2.125525 2.412274
H  4.619365 3.211024 -1.909964
H  4.684747 1.475916 -1.607048
H  5.962625 2.2561 -2.523429
H  -1.613162 2.534731 0.660112
H  -0.301791 -0.290973 -2.292907
H  -3.745147 -2.766864 -0.11662
H  0.455456 3.826837 0.332674
H  1.759459 0.997518 -2.603957
H  2.150521 3.06512 -1.300996
elementType: Cl S O N C H
totalener: -1856.33178317 hartree
nucrepener: 2484.35817046 hartree
electener: -4340.68995363 hartree
oneelecener: -7480.72608042 hartree
twoeener: 3140.03612679 hartree
cpcmener: -0.02503665 hartree
kineticenergy: 1850.60447811 hartree
xcener: -138.234700605503 hartree
chargesum: -0.0000000
charge: -0.046299 -0.046156 -0.285649 -0.376513 -0.140870 -0.196101 -0.144259 -0.056127 -0.150260 -0.159206 -0.100366 -0.105915 -0.106278 -0.283586 0.346385 0.176907 0.250756 0.010507 -0.160006 -0.161744 -0.138247 -0.175225 -0.194605 -0.119244 0.153195 0.075794 0.067930 0.080954 -0.005795 0.073970 0.075761 0.072290 0.075521 0.053681 0.074727 0.070321 0.061711 0.128881 0.117129 0.082202 0.073592 0.098794 0.139413 0.157893 0.153647 0.155164 0.152397 0.172928
qa: -0.0463 -0.0462 -0.2856 -0.3765 -0.1409 -0.1961 -0.1443 -0.0561 -0.1503 -0.1592 -0.1004 -0.1059 -0.1063 -0.2836 0.3464 0.1769 0.2508 0.0105 -0.1600 -0.1617 -0.1382 -0.1752 -0.1946 -0.1192 0.1532 0.0758 0.0679 0.0810 -0.0058 0.0740 0.0758 0.0723 0.0755 0.0537 0.0747 0.0703 0.0617 0.1289 0.1171 0.0822 0.0736 0.0988 0.1394 0.1579 0.1536 0.1552 0.1524 0.1729
va: 1.2561 2.4103 2.1190 2.1231 2.9473 2.9383 3.9109 3.8356 3.9348 3.9110 3.8554 3.8641 3.8873 3.9311 4.2821 3.8692 3.8164 3.5552 3.9778 3.8698 4.0451 3.9522 3.8931 3.8155 4.2087 1.0127 1.0042 1.0118 1.0287 1.0095 1.0105 1.0102 1.0074 1.0215 1.0145 1.0091 1.0032 1.0096 1.0235 1.0001 0.9953 1.0076 1.0179 1.0060 1.0069 0.9956 0.9980 0.9795
dispcorr: -0.026805708 hartree
energy: -1856.358588880505
dipole: 78.09702 -75.46664 2.63038 23.52735 -25.01009 -1.48273 5.71926 -5.62907 0.09020
magnitude: 3.02085 au
magnitude: 7.67839 debye
