program: Orca
programVersion: 5.0.2
elementType: Cl S O O N N C C C C C C C C C C C C C C C C C C C H H H H H H H H H H H H H H H H H H H H H H H
charge: 0
multiplicity: 1
keywords: wb97x-d3
keywords: def2-TZVPP
keywords: def2/J RIJCOSX
keywords: DEFGRID2
keywords: scfconv7
keywords: smallprint printgap noloewdin
keywords: NOSOSCF
formula: C19H23ClN2O2S
InChI: InChI=1/C19H23ClN2O2S/c1-2-3-4-5-6-10-13-25-19(23)24-16-14-17(20)21-22-18(16)15-11-8-7-9-12-15/h7-9,11-12,14H,2-6,10,13H2,1H3
48 atoms
Cl -6.23707 -1.124434 0.24862
S  0.933278 -2.980935 0.259491
O  -1.316111 -2.077036 -0.353586
O  -0.501671 -1.117243 1.511471
N  -3.237526 0.934022 -0.907706
N  -4.438776 0.543867 -0.559261
C  3.859855 0.742231 0.974716
C  3.455757 2.203997 1.13215
C  2.715392 -0.217024 1.28379
C  4.473516 3.203953 0.593325
C  3.173029 -1.666442 1.336321
C  5.817493 3.192632 1.31236
C  2.084505 -2.683928 1.637418
C  6.76515 4.263651 0.793091
C  -0.378912 -1.887667 0.608067
C  -2.363208 -1.201989 -0.406341
C  -2.197582 0.115918 -0.862429
C  -0.905197 0.681297 -1.29453
C  -0.015628 -0.041524 -2.089743
C  -0.589762 1.99389 -0.941226
C  -3.609609 -1.631176 -0.04635
C  1.172118 0.538289 -2.512182
C  0.595696 2.568613 -1.36863
C  1.482082 1.841275 -2.152279
C  -4.625382 -0.68888 -0.160369
H  4.709841 0.518232 1.627262
H  4.209305 0.565783 -0.049207
H  3.262281 2.412534 2.190231
H  2.503455 2.364155 0.618275
H  1.937623 -0.091129 0.523926
H  2.25874 0.050786 2.242149
H  4.047521 4.210658 0.659228
H  4.633158 3.016194 -0.474785
H  3.675131 -1.938074 0.403201
H  3.924997 -1.772727 2.124765
H  5.654201 3.33794 2.385228
H  6.291612 2.2126 1.208736
H  2.526654 -3.664782 1.820442
H  1.507652 -2.425797 2.526531
H  6.339531 5.262416 0.911417
H  6.980169 4.124125 -0.268431
H  7.718568 4.249753 1.323629
H  -0.254493 -1.04341 -2.420383
H  -1.272704 2.564316 -0.325503
H  -3.787842 -2.63734 0.30802
H  1.850566 -0.029881 -3.134903
H  0.829093 3.5872 -1.087178
H  2.409342 2.291318 -2.483058
elementType: Cl S O N C H
totalener: -1856.33262104 hartree
nucrepener: 2479.79580517 hartree
electener: -4336.12842622 hartree
oneelecener: -7471.88105337 hartree
twoeener: 3135.75262716 hartree
cpcmener: -0.02472467 hartree
kineticenergy: 1850.59777514 hartree
xcener: -138.232206687903 hartree
chargesum: 0.0000000
charge: -0.045168 -0.042857 -0.288119 -0.378864 -0.141788 -0.197856 -0.138408 -0.131695 -0.058751 -0.136516 -0.111493 -0.072792 -0.116816 -0.285192 0.336631 0.148777 0.259512 0.032814 -0.188844 -0.143999 -0.121429 -0.157627 -0.187433 -0.136083 0.152076 0.071797 0.065806 0.075170 0.067045 -0.011732 0.074982 0.070000 0.057214 0.072533 0.078633 0.055351 0.056338 0.136449 0.111980 0.077864 0.077896 0.089244 0.156350 0.138879 0.154272 0.154156 0.161062 0.160633
qa: -0.0452 -0.0429 -0.2881 -0.3789 -0.1418 -0.1979 -0.1384 -0.1317 -0.0588 -0.1365 -0.1115 -0.0728 -0.1168 -0.2852 0.3366 0.1488 0.2595 0.0328 -0.1888 -0.1440 -0.1214 -0.1576 -0.1874 -0.1361 0.1521 0.0718 0.0658 0.0752 0.0670 -0.0117 0.0750 0.0700 0.0572 0.0725 0.0786 0.0554 0.0563 0.1364 0.1120 0.0779 0.0779 0.0892 0.1564 0.1389 0.1543 0.1542 0.1611 0.1606
va: 1.2577 2.4084 2.1067 2.1167 2.9511 2.9400 3.8871 3.8862 3.8924 3.8959 3.8871 3.8569 3.8850 3.9509 4.3056 3.8949 3.8258 3.5619 3.8809 3.9627 4.0461 3.8763 3.8953 3.8367 4.2065 1.0100 1.0076 1.0122 1.0192 1.0268 1.0144 1.0103 1.0096 1.0131 1.0113 1.0065 1.0081 1.0045 1.0257 1.0014 1.0004 1.0039 1.0091 1.0214 1.0057 0.9955 0.9926 0.9898
dispcorr: -0.026315667 hartree
energy: -1856.358936710224
dipole: 76.00214 -73.57828 2.42386 27.17041 -28.91448 -1.74408 9.64841 -9.41338 0.23503
magnitude: 2.99535 au
magnitude: 7.61357 debye
