program: Orca
programVersion: 5.0.2
elementType: Cl S O O N N C C C C C C C C C C C C C C C C C C C H H H H H H H H H H H H H H H H H H H H H H H
charge: 0
multiplicity: 1
keywords: wb97x-d3
keywords: def2-TZVPP
keywords: def2/J RIJCOSX
keywords: DEFGRID2
keywords: scfconv7
keywords: smallprint printgap noloewdin
keywords: NOSOSCF
formula: C19H23ClN2O2S
InChI: InChI=1/C19H23ClN2O2S/c1-2-3-4-5-6-10-13-25-19(23)24-16-14-17(20)21-22-18(16)15-11-8-7-9-12-15/h7-9,11-12,14H,2-6,10,13H2,1H3
48 atoms
Cl -5.864204 -0.354442 0.774831
S  1.146493 -2.622008 0.770613
O  -1.070704 -1.745631 0.014813
O  -0.017724 -0.302183 1.378269
N  -2.921286 1.134661 -1.147483
N  -4.095043 0.927004 -0.601839
C  3.534474 0.353503 0.04037
C  4.343985 1.083147 1.105583
C  3.908038 -1.11527 -0.135997
C  4.138134 2.596252 1.09758
C  3.815791 -1.969397 1.123172
C  2.700334 3.061316 1.319714
C  2.468812 -1.948182 1.828398
C  2.095256 2.594579 2.635027
C  -0.038771 -1.344928 0.795753
C  -2.087925 -0.855417 -0.185421
C  -1.918801 0.286317 -0.983484
C  -0.655719 0.623166 -1.666316
C  -0.191066 1.93737 -1.631228
C  0.058288 -0.334998 -2.38537
C  -3.306548 -1.096161 0.384382
C  0.969906 2.286289 -2.302645
C  1.216795 0.020955 -3.060515
C  1.675407 1.329894 -3.020695
C  -4.28869 -0.148107 0.119173
H  3.67694 0.857048 -0.921031
H  2.466107 0.441644 0.25822
H  5.408529 0.877075 0.951012
H  4.107335 0.685327 2.097334
H  4.934246 -1.18228 -0.509271
H  3.278054 -1.54874 -0.918065
H  4.493982 2.996687 0.142639
H  4.77599 3.042393 1.867837
H  4.085652 -3.000803 0.881312
H  4.553547 -1.63781 1.859365
H  2.683743 4.154521 1.286643
H  2.06586 2.731621 0.491815
H  2.500456 -2.562541 2.72706
H  2.182969 -0.942692 2.132439
H  2.708997 2.899099 3.485736
H  1.992622 1.509536 2.678306
H  1.100155 3.016571 2.782008
H  -0.734166 2.687465 -1.071356
H  -0.299747 -1.353725 -2.455576
H  -3.486181 -1.961604 1.007859
H  1.323586 3.308314 -2.265196
H  1.75661 -0.727473 -3.625856
H  2.580779 1.604463 -3.546556
elementType: Cl S O N C H
totalener: -1856.32930181 hartree
nucrepener: 2575.45283907 hartree
electener: -4431.78214088 hartree
oneelecener: -7663.26380861 hartree
twoeener: 3231.48166773 hartree
cpcmener: -0.02465305 hartree
kineticenergy: 1850.61152120 hartree
xcener: -138.240253047301 hartree
chargesum: 0.0000000
charge: -0.045288 -0.045974 -0.289838 -0.385399 -0.142489 -0.194824 -0.071434 -0.153355 -0.178828 -0.146515 -0.141199 -0.067361 -0.102356 -0.284132 0.363581 0.155245 0.256062 0.049956 -0.168729 -0.185801 -0.124370 -0.180260 -0.168235 -0.130603 0.150599 0.084908 0.013137 0.076779 0.071967 0.080303 0.078857 0.067501 0.075488 0.095228 0.086287 0.072848 0.026976 0.131639 0.096589 0.088733 0.066582 0.095294 0.140569 0.154014 0.153560 0.156827 0.155433 0.162029
qa: -0.0453 -0.0460 -0.2898 -0.3854 -0.1425 -0.1948 -0.0714 -0.1534 -0.1788 -0.1465 -0.1412 -0.0674 -0.1024 -0.2841 0.3636 0.1552 0.2561 0.0500 -0.1687 -0.1858 -0.1244 -0.1803 -0.1682 -0.1306 0.1506 0.0849 0.0131 0.0768 0.0720 0.0803 0.0789 0.0675 0.0755 0.0952 0.0863 0.0728 0.0270 0.1316 0.0966 0.0887 0.0666 0.0953 0.1406 0.1540 0.1536 0.1568 0.1554 0.1620
va: 1.2574 2.4203 2.1095 2.1044 2.9532 2.9388 3.7956 3.8935 3.9085 3.9052 3.8800 3.8505 3.9087 3.9415 4.2615 3.8819 3.8121 3.5377 3.9329 3.8749 4.0490 3.8754 3.8593 3.8210 4.2083 1.0104 1.0158 1.0128 0.9955 1.0123 1.0172 1.0118 1.0079 1.0111 1.0047 1.0106 1.0213 1.0098 1.0290 1.0035 0.9943 1.0048 1.0199 1.0094 1.0060 0.9930 0.9941 0.9883
dispcorr: -0.029436264 hartree
energy: -1856.358738071474
dipole: 62.70503 -60.30821 2.39682 15.23507 -17.03515 -1.80008 7.69487 -7.25400 0.44087
magnitude: 3.02975 au
magnitude: 7.70102 debye
