program: Orca
programVersion: 5.0.2
elementType: Cl S O O N N C C C C C C C C C C C C C C C C C C C H H H H H H H H H H H H H H H H H H H H H H H
charge: 0
multiplicity: 1
keywords: wb97x-d3
keywords: def2-TZVPP
keywords: def2/J RIJCOSX
keywords: DEFGRID2
keywords: scfconv7
keywords: smallprint printgap noloewdin
keywords: NOSOSCF
formula: C19H23ClN2O2S
InChI: InChI=1/C19H23ClN2O2S/c1-2-3-4-5-6-10-13-25-19(23)24-16-14-17(20)21-22-18(16)15-11-8-7-9-12-15/h7-9,11-12,14H,2-6,10,13H2,1H3
48 atoms
Cl -6.193703 -1.24655 0.199801
S  0.885894 0.191715 2.024972
O  -1.250625 -0.537407 0.918668
O  -0.937088 1.688516 0.806136
N  -3.315268 -0.066401 -2.013298
N  -4.496875 -0.403195 -1.553627
C  4.740414 1.156101 1.307905
C  5.880116 0.237091 0.873679
C  3.555937 1.161262 0.34897
C  5.517893 -1.241332 0.744143
C  2.443164 2.129343 0.735584
C  4.957737 -1.864751 2.016681
C  1.732183 1.802333 2.040544
C  4.740989 -3.364551 1.887873
C  -0.561513 0.607785 1.1457
C  -2.340411 -0.484817 0.099832
C  -2.236281 -0.112915 -1.250395
C  -0.958243 0.265763 -1.881997
C  0.17595 -0.533897 -1.752176
C  -0.887531 1.443117 -2.623695
C  -3.561705 -0.847166 0.596138
C  1.367288 -0.152696 -2.352749
C  0.307358 1.825088 -3.212166
C  1.437974 1.029967 -3.075582
C  -4.61496 -0.795625 -0.31038
H  5.129717 2.175702 1.395844
H  4.413873 0.877904 2.314349
H  6.701208 0.336902 1.59098
H  6.276745 0.588028 -0.084638
H  3.140261 0.15365 0.255397
H  3.910576 1.428461 -0.651608
H  6.41745 -1.790335 0.446703
H  4.802711 -1.385171 -0.072711
H  2.855677 3.137848 0.842839
H  1.709613 2.18713 -0.071911
H  5.637972 -1.664081 2.851065
H  4.008903 -1.388191 2.279268
H  2.430813 1.730923 2.875555
H  1.005935 2.569389 2.308113
H  4.051593 -3.598637 1.073981
H  4.322537 -3.78952 2.801681
H  5.677871 -3.886747 1.682917
H  0.132679 -1.467944 -1.206185
H  -1.764416 2.069415 -2.725895
H  -3.695596 -1.145892 1.627151
H  2.241368 -0.783452 -2.255155
H  0.355795 2.746951 -3.777027
H  2.371013 1.329981 -3.534941
elementType: Cl S O N C H
totalener: -1856.33135688 hartree
nucrepener: 2501.11529865 hartree
electener: -4357.44665553 hartree
oneelecener: -7514.11427009 hartree
twoeener: 3156.66761456 hartree
cpcmener: -0.02513754 hartree
kineticenergy: 1850.59945308 hartree
xcener: -138.235271744626 hartree
chargesum: 0.0000000
charge: -0.045864 -0.059252 -0.284669 -0.375049 -0.140560 -0.196782 -0.117664 -0.159777 -0.143093 -0.127011 -0.143958 -0.080212 -0.132475 -0.279118 0.364107 0.171444 0.246142 0.032943 -0.172579 -0.176846 -0.137373 -0.187944 -0.159051 -0.126427 0.151987 0.080433 0.067516 0.074774 0.071949 0.046761 0.085526 0.075337 0.064336 0.089362 0.079922 0.061367 0.045843 0.135047 0.131114 0.077088 0.089396 0.079127 0.155905 0.141229 0.155057 0.157743 0.155854 0.158392
qa: -0.0459 -0.0593 -0.2847 -0.3750 -0.1406 -0.1968 -0.1177 -0.1598 -0.1431 -0.1270 -0.1440 -0.0802 -0.1325 -0.2791 0.3641 0.1714 0.2461 0.0329 -0.1726 -0.1768 -0.1374 -0.1879 -0.1591 -0.1264 0.1520 0.0804 0.0675 0.0748 0.0719 0.0468 0.0855 0.0753 0.0643 0.0894 0.0799 0.0614 0.0458 0.1350 0.1311 0.0771 0.0894 0.0791 0.1559 0.1412 0.1551 0.1577 0.1559 0.1584
va: 1.2566 2.4068 2.1187 2.1292 2.9506 2.9393 3.8673 3.9251 3.8512 3.8542 3.8763 3.8558 3.8856 3.9492 4.2839 3.8739 3.8242 3.5517 3.8583 3.9810 4.0440 3.8754 3.9257 3.8467 4.2088 1.0126 1.0014 1.0081 1.0098 1.0165 1.0112 1.0095 1.0026 1.0122 1.0192 1.0089 1.0033 1.0022 1.0225 1.0009 1.0034 1.0024 1.0085 1.0168 1.0062 0.9942 0.9929 0.9916
dispcorr: -0.026809219 hartree
energy: -1856.358166094341
dipole: 76.00998 -73.42123 2.58876 2.01422 -1.95458 0.05964 8.83174 -7.23821 1.59353
magnitude: 3.04048 au
magnitude: 7.72830 debye
