program: Orca
programVersion: 5.0.2
elementType: Cl S O O N N C C C C C C C C C C C C C C C C C C C H H H H H H H H H H H H H H H H H H H H H H H
charge: 0
multiplicity: 1
keywords: wb97x-d3
keywords: def2-TZVPP
keywords: def2/J RIJCOSX
keywords: DEFGRID2
keywords: scfconv7
keywords: smallprint printgap noloewdin
keywords: NOSOSCF
formula: C19H23ClN2O2S
InChI: InChI=1/C19H23ClN2O2S/c1-2-3-4-5-6-10-13-25-19(23)24-16-14-17(20)21-22-18(16)15-11-8-7-9-12-15/h7-9,11-12,14H,2-6,10,13H2,1H3
48 atoms
Cl -5.004705 -0.225843 -2.806146
S  1.166848 -2.755098 0.551741
O  -1.112127 -1.859724 -0.041445
O  0.532899 -0.391848 -0.476647
N  -3.166442 1.105323 0.263793
N  -3.985947 0.957016 -0.749636
C  4.936249 0.067893 -0.381071
C  4.017741 1.050759 -1.096949
C  4.843063 -1.368782 -0.893995
C  4.212491 2.489928 -0.633792
C  3.440949 -1.979743 -0.892656
C  3.240863 3.484617 -1.264915
C  2.809212 -1.977776 0.489152
C  1.7991 3.31861 -0.802555
C  0.183005 -1.460849 -0.07609
C  -2.071856 -0.918592 -0.284869
C  -2.231928 0.210863 0.536309
C  -1.366009 0.490192 1.697188
C  -1.097283 -0.488771 2.651711
C  -0.797477 1.755695 1.832584
C  -2.921133 -1.094908 -1.341421
C  -0.255243 -0.207244 3.717768
C  0.045785 2.030509 2.897132
C  0.32467 1.04759 3.837954
C  -3.881486 -0.10311 -1.510123
H  4.725789 0.096851 0.693233
H  5.974311 0.399748 -0.48442
H  2.97793 0.754341 -0.941552
H  4.190961 0.993433 -2.17785
H  5.510008 -2.001835 -0.300315
H  5.223403 -1.408263 -1.919205
H  5.23874 2.79866 -0.857072
H  4.114224 2.538323 0.456867
H  2.800139 -1.447402 -1.597744
H  3.504028 -3.009185 -1.253036
H  3.570632 4.500228 -1.029061
H  3.28996 3.39942 -2.355257
H  3.406443 -2.565331 1.189864
H  2.717699 -0.978198 0.914149
H  1.150709 4.073425 -1.250827
H  1.72221 3.424319 0.281904
H  1.386283 2.344348 -1.066671
H  -1.5571 -1.466514 2.582508
H  -0.998337 2.519427 1.091981
H  -2.840916 -1.944882 -2.00567
H  -0.05396 -0.972172 4.45628
H  0.491698 3.012439 2.988824
H  0.988458 1.261674 4.66564
elementType: Cl S O N C H
totalener: -1856.33156868 hartree
nucrepener: 2526.39935345 hartree
electener: -4382.73092213 hartree
oneelecener: -7565.23986451 hartree
twoeener: 3182.50894238 hartree
cpcmener: -0.02441903 hartree
kineticenergy: 1850.59698152 hartree
xcener: -138.233581577517 hartree
chargesum: -0.0000000
charge: -0.045975 -0.041076 -0.287094 -0.388829 -0.140013 -0.197532 -0.128303 -0.106659 -0.160866 -0.117888 -0.160785 -0.099355 -0.109081 -0.270372 0.366997 0.176289 0.238149 0.045167 -0.176423 -0.207895 -0.138878 -0.177008 -0.165212 -0.118938 0.153953 0.066785 0.074732 0.042671 0.065910 0.080549 0.077241 0.070589 0.058144 0.088584 0.089766 0.069115 0.051610 0.138511 0.113558 0.093750 0.068305 0.073317 0.158014 0.146860 0.154831 0.156579 0.158936 0.159271
qa: -0.0460 -0.0411 -0.2871 -0.3888 -0.1400 -0.1975 -0.1283 -0.1067 -0.1609 -0.1179 -0.1608 -0.0994 -0.1091 -0.2704 0.3670 0.1763 0.2381 0.0452 -0.1764 -0.2079 -0.1389 -0.1770 -0.1652 -0.1189 0.1540 0.0668 0.0747 0.0427 0.0659 0.0805 0.0772 0.0706 0.0581 0.0886 0.0898 0.0691 0.0516 0.1385 0.1136 0.0938 0.0683 0.0733 0.1580 0.1469 0.1548 0.1566 0.1589 0.1593
va: 1.2563 2.4228 2.1206 2.0925 2.9450 2.9393 3.8672 3.8546 3.9250 3.8874 3.8755 3.9091 3.8746 3.9321 4.2424 3.8721 3.8309 3.5540 3.8766 3.9644 4.0470 3.9156 3.9208 3.8839 4.2068 1.0033 1.0119 1.0105 1.0128 1.0076 1.0086 1.0109 1.0088 1.0118 1.0187 1.0060 1.0088 1.0067 1.0178 1.0056 1.0021 1.0033 1.0071 1.0134 1.0066 0.9935 0.9925 0.9890
dispcorr: -0.026292500 hartree
energy: -1856.357861182440
dipole: 61.06854 -58.74626 2.32228 16.25096 -18.13609 -1.88513 5.31577 -4.80973 0.50603
magnitude: 3.03360 au
magnitude: 7.71081 debye
