program: Orca
programVersion: 5.0.2
elementType: Cl S O O N N C C C C C C C C C C C C C C C C C C C H H H H H H H H H H H H H H H H H H H H H H H
charge: 0
multiplicity: 1
keywords: wb97x-d3
keywords: def2-TZVPP
keywords: def2/J RIJCOSX
keywords: DEFGRID2
keywords: scfconv7
keywords: smallprint printgap noloewdin
keywords: NOSOSCF
formula: C19H23ClN2O2S
InChI: InChI=1/C19H23ClN2O2S/c1-2-3-4-5-6-10-13-25-19(23)24-16-14-17(20)21-22-18(16)15-11-8-7-9-12-15/h7-9,11-12,14H,2-6,10,13H2,1H3
48 atoms
Cl -6.162354 -1.318572 0.106323
S  0.937269 -0.216214 2.059608
O  -1.201672 -0.759894 0.853659
O  -0.948695 1.448052 1.209954
N  -3.317142 0.248374 -1.899219
N  -4.490435 -0.171522 -1.491293
C  4.69509 0.993201 1.378376
C  5.827832 0.236236 0.687328
C  3.465059 1.198974 0.502595
C  5.475349 -1.169541 0.204396
C  2.36236 2.021165 1.161073
C  4.955422 -2.099464 1.294289
C  1.737301 1.38416 2.39314
C  4.720718 -3.516635 0.791922
C  -0.539751 0.330789 1.309825
C  -2.308438 -0.558505 0.0802
C  -2.226933 0.066918 -1.1747
C  -0.964805 0.579207 -1.739985
C  0.177457 -0.217333 -1.799234
C  -0.921917 1.881284 -2.234495
C  -3.521151 -1.008307 0.520504
C  1.347473 0.287728 -2.347111
C  0.25294 2.385054 -2.76899
C  1.390262 1.589658 -2.825927
C  -4.590252 -0.786471 -0.341043
H  5.071986 1.97141 1.694422
H  4.422333 0.471477 2.300447
H  6.674292 0.170203 1.378325
H  6.18155 0.823625 -0.166094
H  3.054709 0.233857 0.190827
H  3.764633 1.705617 -0.420018
H  6.370149 -1.613749 -0.243897
H  4.73867 -1.115358 -0.603858
H  2.76339 2.990664 1.473849
H  1.581167 2.240985 0.429295
H  5.666669 -2.120089 2.126611
H  4.020493 -1.708556 1.706625
H  2.484761 1.156896 3.154021
H  1.006157 2.042496 2.86211
H  4.331104 -4.163057 1.580036
H  5.64457 -3.968407 0.424845
H  4.000054 -3.532066 -0.028687
H  0.153787 -1.240008 -1.444599
H  -1.805897 2.504355 -2.185293
H  -3.640297 -1.493535 1.479815
H  2.227081 -0.34023 -2.401459
H  0.280512 3.401237 -3.140429
H  2.307246 1.983116 -3.245558
elementType: Cl S O N C H
totalener: -1856.33135491 hartree
nucrepener: 2510.22212108 hartree
electener: -4366.55347599 hartree
oneelecener: -7532.33956340 hartree
twoeener: 3165.78608741 hartree
cpcmener: -0.02505528 hartree
kineticenergy: 1850.60577685 hartree
xcener: -138.236580807005 hartree
chargesum: -0.0000000
charge: -0.045349 -0.057633 -0.284981 -0.376009 -0.140112 -0.195549 -0.116728 -0.161304 -0.145605 -0.122932 -0.142526 -0.081814 -0.132784 -0.280482 0.362607 0.167735 0.246570 0.038000 -0.177984 -0.175769 -0.135491 -0.184613 -0.163494 -0.124221 0.151561 0.079467 0.067691 0.075315 0.072688 0.042786 0.087559 0.075095 0.061116 0.089221 0.081259 0.061746 0.046363 0.135104 0.131773 0.089847 0.079687 0.077730 0.155504 0.141200 0.154251 0.159440 0.155653 0.158410
qa: -0.0453 -0.0576 -0.2850 -0.3760 -0.1401 -0.1955 -0.1167 -0.1613 -0.1456 -0.1229 -0.1425 -0.0818 -0.1328 -0.2805 0.3626 0.1677 0.2466 0.0380 -0.1780 -0.1758 -0.1355 -0.1846 -0.1635 -0.1242 0.1516 0.0795 0.0677 0.0753 0.0727 0.0428 0.0876 0.0751 0.0611 0.0892 0.0813 0.0617 0.0464 0.1351 0.1318 0.0898 0.0797 0.0777 0.1555 0.1412 0.1543 0.1594 0.1557 0.1584
va: 1.2572 2.4069 2.1187 2.1281 2.9507 2.9392 3.8689 3.9240 3.8535 3.8550 3.8680 3.8562 3.8873 3.9492 4.2830 3.8768 3.8253 3.5519 3.8610 3.9792 4.0460 3.8695 3.9300 3.8500 4.2091 1.0128 1.0007 1.0080 1.0099 1.0168 1.0104 1.0096 1.0030 1.0127 1.0198 1.0092 1.0036 1.0016 1.0221 1.0034 1.0021 1.0009 1.0089 1.0168 1.0066 0.9938 0.9932 0.9916
dispcorr: -0.027118449 hartree
energy: -1856.358473356432
dipole: 75.27824 -72.68442 2.59383 2.05438 -2.26181 -0.20743 6.12373 -4.59884 1.52489
magnitude: 3.01600 au
magnitude: 7.66606 debye
