program: Orca
programVersion: 5.0.2
elementType: Cl S O O N N C C C C C C C C C C C C C C C C C C C H H H H H H H H H H H H H H H H H H H H H H H
charge: 0
multiplicity: 1
keywords: wb97x-d3
keywords: def2-TZVPP
keywords: def2/J RIJCOSX
keywords: DEFGRID2
keywords: scfconv7
keywords: smallprint printgap noloewdin
keywords: NOSOSCF
formula: C19H23ClN2O2S
InChI: InChI=1/C19H23ClN2O2S/c1-2-3-4-5-6-10-13-25-19(23)24-16-14-17(20)21-22-18(16)15-11-8-7-9-12-15/h7-9,11-12,14H,2-6,10,13H2,1H3
48 atoms
Cl -6.136616 -0.671989 0.598971
S  0.879455 -3.041286 0.40396
O  -1.3343 -2.001933 -0.156733
O  -0.167454 -0.784114 1.334302
N  -3.080768 1.088791 -0.86181
N  -4.284789 0.80781 -0.426854
C  5.145183 0.132578 0.638571
C  4.468647 1.480228 0.391515
C  4.299165 -0.891092 1.395285
C  4.276349 2.311852 1.654767
C  3.057295 -1.323143 0.623143
C  3.401827 3.548039 1.462016
C  2.292345 -2.411172 1.355614
C  3.901761 4.514446 0.398008
C  -0.258559 -1.739252 0.624335
C  -2.317839 -1.05877 -0.237951
C  -2.095968 0.206957 -0.804557
C  -0.791846 0.648995 -1.33363
C  -0.037677 -0.157207 -2.184223
C  -0.318496 1.915503 -0.99382
C  -3.56868 -1.373653 0.214682
C  1.174308 0.299474 -2.682396
C  0.893376 2.365621 -1.491753
C  1.64387 1.558144 -2.336238
C  -4.526222 -0.376182 0.075979
H  6.078276 0.297792 1.186674
H  5.435534 -0.302857 -0.322885
H  3.501894 1.328227 -0.098243
H  5.073957 2.04332 -0.323932
H  4.006079 -0.497879 2.37286
H  4.915565 -1.771842 1.598387
H  5.258269 2.613984 2.035238
H  3.826708 1.697014 2.439861
H  2.401382 -0.467828 0.454639
H  3.351488 -1.692112 -0.36265
H  2.383577 3.230742 1.213881
H  3.3259 4.076324 2.416744
H  2.918052 -3.291965 1.513829
H  1.94234 -2.087426 2.336024
H  4.924951 4.838637 0.601964
H  3.278768 5.409486 0.357066
H  3.892168 4.070819 -0.598888
H  -0.401351 -1.129705 -2.490028
H  -0.89516 2.546486 -0.330247
H  -3.790759 -2.334764 0.658181
H  1.747691 -0.32989 -3.350049
H  1.253239 3.349543 -1.219484
H  2.589838 1.911863 -2.725429
elementType: Cl S O N C H
totalener: -1856.33159400 hartree
nucrepener: 2509.79729825 hartree
electener: -4366.12889225 hartree
oneelecener: -7531.74093358 hartree
twoeener: 3165.61204134 hartree
cpcmener: -0.02478184 hartree
kineticenergy: 1850.61794057 hartree
xcener: -138.237825813383 hartree
chargesum: 0.0000000
charge: -0.045589 -0.044098 -0.286137 -0.377834 -0.140244 -0.197416 -0.136821 -0.087926 -0.162726 -0.117625 -0.104000 -0.118365 -0.110274 -0.288021 0.346629 0.165781 0.249814 0.025220 -0.167286 -0.156739 -0.134335 -0.183004 -0.182951 -0.123363 0.151577 0.074530 0.076100 -0.001467 0.085461 0.075455 0.081555 0.065205 0.071856 0.057252 0.074490 0.052511 0.074019 0.129178 0.117872 0.088915 0.095651 0.075603 0.157836 0.138089 0.153877 0.153500 0.170721 0.157523
qa: -0.0456 -0.0441 -0.2861 -0.3778 -0.1402 -0.1974 -0.1368 -0.0879 -0.1627 -0.1176 -0.1040 -0.1184 -0.1103 -0.2880 0.3466 0.1658 0.2498 0.0252 -0.1673 -0.1567 -0.1343 -0.1830 -0.1830 -0.1234 0.1516 0.0745 0.0761 -0.0015 0.0855 0.0755 0.0816 0.0652 0.0719 0.0573 0.0745 0.0525 0.0740 0.1292 0.1179 0.0889 0.0957 0.0756 0.1578 0.1381 0.1539 0.1535 0.1707 0.1575
va: 1.2570 2.4124 2.1183 2.1213 2.9489 2.9394 3.9211 3.8852 3.9269 3.8648 3.8587 3.8961 3.8919 3.9275 4.2827 3.8818 3.8205 3.5536 3.8559 3.9799 4.0446 3.8982 3.8848 3.8274 4.2085 1.0089 1.0081 1.0212 1.0049 1.0050 1.0109 1.0087 1.0111 1.0121 1.0155 1.0096 1.0090 1.0098 1.0228 1.0028 1.0037 0.9968 1.0063 1.0209 1.0067 0.9955 0.9801 0.9924
dispcorr: -0.027212762 hartree
energy: -1856.358806763804
dipole: 71.08302 -68.73851 2.34450 22.99875 -24.82150 -1.82275 5.91086 -5.71788 0.19298
magnitude: 2.97596 au
magnitude: 7.56430 debye
