program: Orca
programVersion: 5.0.2
elementType: Cl S O O N N C C C C C C C C C C C C C C C C C C C H H H H H H H H H H H H H H H H H H H H H H H
charge: 0
multiplicity: 1
keywords: wb97x-d3
keywords: def2-TZVPP
keywords: def2/J RIJCOSX
keywords: DEFGRID2
keywords: scfconv7
keywords: smallprint printgap noloewdin
keywords: NOSOSCF
formula: C19H23ClN2O2S
InChI: InChI=1/C19H23ClN2O2S/c1-2-3-4-5-6-10-13-25-19(23)24-16-14-17(20)21-22-18(16)15-11-8-7-9-12-15/h7-9,11-12,14H,2-6,10,13H2,1H3
48 atoms
Cl -6.099032 -1.049852 0.38511
S  1.11329 -2.577042 0.711222
O  -1.137594 -1.83384 -0.101476
O  -0.266529 -0.413095 1.409553
N  -3.201818 0.981058 -1.048088
N  -4.382246 0.584193 -0.638819
C  3.63533 0.062392 -0.037625
C  4.277746 0.985914 0.988623
C  4.045615 -1.40139 0.086911
C  3.858509 2.44167 0.827022
C  3.724285 -2.051127 1.430441
C  4.523849 3.369109 1.835818
C  2.291287 -1.867132 1.908276
C  4.095708 4.821061 1.686833
C  -0.178576 -1.40959 0.757515
C  -2.226508 -1.029429 -0.280868
C  -2.128129 0.221172 -0.909722
C  -0.863022 0.766207 -1.435007
C  -0.510081 2.082013 -1.142582
C  -0.034648 -0.001803 -2.252417
C  -3.450638 -1.466936 0.140653
C  0.659165 2.620505 -1.65629
C  1.127204 0.54629 -2.77459
C  1.478037 1.855087 -2.475488
C  -4.509825 -0.595358 -0.086674
H  3.900113 0.407395 -1.041429
H  2.545072 0.151711 0.021968
H  5.36822 0.909145 0.911685
H  4.023277 0.658095 2.0020
H  5.122242 -1.492715 -0.083764
H  3.569201 -1.970284 -0.716382
H  2.769664 2.517315 0.926473
H  4.093393 2.780948 -0.188353
H  3.969499 -3.115241 1.387995
H  4.361214 -1.634535 2.214926
H  4.295125 3.024094 2.849056
H  5.611006 3.296588 1.73058
H  2.137006 -2.366855 2.86396
H  2.048212 -0.813763 2.042026
H  4.594964 5.462635 2.414741
H  3.019695 4.936077 1.832926
H  4.334482 5.207077 0.693579
H  -1.146705 2.680685 -0.503752
H  -0.30601 -1.016941 -2.512629
H  -3.580296 -2.423546 0.628422
H  0.931694 3.639874 -1.415375
H  1.758415 -0.053101 -3.417498
H  2.389438 2.277777 -2.877913
elementType: Cl S O N C H
totalener: -1856.33139289 hartree
nucrepener: 2513.20056111 hartree
electener: -4369.53195400 hartree
oneelecener: -7538.63630449 hartree
twoeener: 3169.10435049 hartree
cpcmener: -0.02510787 hartree
kineticenergy: 1850.61973294 hartree
xcener: -138.238828214317 hartree
chargesum: -0.0000000
charge: -0.045414 -0.044136 -0.287782 -0.381845 -0.142372 -0.194553 -0.051073 -0.146247 -0.174475 -0.096992 -0.157575 -0.083371 -0.122415 -0.279966 0.362531 0.164338 0.262326 0.022897 -0.153276 -0.177676 -0.132759 -0.186326 -0.174199 -0.127619 0.151598 0.080720 0.008504 0.066458 0.061898 0.078887 0.086234 0.053403 0.059637 0.098389 0.089508 0.054602 0.054077 0.131584 0.110040 0.090168 0.077597 0.076806 0.139851 0.153125 0.153858 0.156608 0.153809 0.160615
qa: -0.0454 -0.0441 -0.2878 -0.3818 -0.1424 -0.1946 -0.0511 -0.1462 -0.1745 -0.0970 -0.1576 -0.0834 -0.1224 -0.2800 0.3625 0.1643 0.2623 0.0229 -0.1533 -0.1777 -0.1328 -0.1863 -0.1742 -0.1276 0.1516 0.0807 0.0085 0.0665 0.0619 0.0789 0.0862 0.0534 0.0596 0.0984 0.0895 0.0546 0.0541 0.1316 0.1100 0.0902 0.0776 0.0768 0.1399 0.1531 0.1539 0.1566 0.1538 0.1606
va: 1.2571 2.4260 2.1131 2.1180 2.9503 2.9383 3.8409 3.8915 3.9145 3.8734 3.8823 3.8930 3.9131 3.9468 4.2747 3.8774 3.7935 3.5582 3.9608 3.8697 4.0507 3.8987 3.8640 3.8102 4.2075 1.0056 1.0118 1.0118 1.0055 1.0124 1.0100 1.0104 1.0072 1.0098 1.0024 1.0061 1.0073 1.0072 1.0207 1.0043 1.0010 1.0010 1.0179 1.0086 1.0065 0.9935 0.9956 0.9896
dispcorr: -0.026794577 hartree
energy: -1856.358187465178
dipole: 70.09332 -67.50685 2.58647 22.62148 -24.30362 -1.68214 8.47786 -8.00051 0.47735
magnitude: 3.12207 au
magnitude: 7.93566 debye
