program: Gaussian 09
title: 000059663
version: EM64L-G09RevD.01
frameworkgroup: C1[X(C13H18N2O3)]
method: RPBEPBE
basis: SDD
operation: Freq
keyword: #p
keyword: freq=noraman
keyword: PBEPBE/SDD
title: #p freq=noraman PBEPBE/SDD
converged: YES YES NO NO
title: Mulliken charges:
elementType: O O O N N C C C C C C C C C C C C C H H H H H H H H H H H H H H H H H H
charge: -0.193943 -0.202923 -0.219635 -0.375975 -0.379065 -0.086872 0.502453 -0.594237 -0.413789 -0.395063 -0.365732 -0.400566 -0.467856 -0.326887 -0.767793 0.163013 0.159763 0.158211 0.213688 0.219364 0.214215 0.212322 0.235563 0.196078 0.184933 0.198275 0.202082 0.210249 0.201182 0.201985 0.244157 0.259765 0.228075 0.255473 0.365622 0.363868
chargesum: 0.00000
title: Mulliken charges with hydrogens summed into heavy atoms:
elementType: O O O N N C C C C C C C C C C C C C
charge: -0.193943 -0.202923 -0.219635 -0.010353 -0.015197 -0.086872 0.502453 -0.161185 0.012748 0.036578 0.017475 0.011765 -0.064689 -0.082729 -0.024480 0.163013 0.159763 0.158211
polarizability: 1.88645180e+02 1.85297762e+01 1.56503636e+02 1.34372530e+01 9.21740062e-02 1.29094186e+02
1716.lowfreq: -9.1405 -0.0007 0.0003 0.0005 4.4114 12.7654 24.6845 37.4418 67.5516
frequency: 23.9782 37.2356 67.5210 125.1836 137.3770 139.6457 160.5014 171.1572 199.1391 229.3430 265.5015 281.4293 291.3344 299.1430 317.7726 354.4613 359.2950 374.1552 382.3847 436.2810 449.3125 476.7813 481.0832 521.8825 580.3689 606.0956 639.2927 657.9567 679.4257 690.7143 718.6511 734.2877 762.8689 771.6013 791.1936 826.4656 835.7378 839.1344 875.2445 890.7625 916.5642 918.5173 991.0914 992.5970 1010.0404 1011.7445 1036.4735 1092.1982 1095.6811 1115.9893 1117.4175 1135.6203 1143.5944 1159.0995 1182.2258 1217.3339 1226.2545 1244.5515 1258.5111 1281.7002 1289.0590 1308.5216 1317.5210 1334.2200 1340.2301 1352.9631 1360.7425 1364.4306 1366.2697 1372.2806 1376.4203 1384.6367 1461.9314 1466.6041 1469.0473 1473.0498 1474.0708 1477.1895 1483.9105 1496.8753 1615.1738 1650.1508 1667.7467 1675.8370 2958.5825 2967.3975 2969.9808 2974.5172 2979.7380 2987.8724 3003.6208 3014.9611 3021.7261 3026.1646 3035.0116 3037.5131 3045.7607 3097.9506 3129.6153 3135.6138 3513.7556 3515.6390
redmass: 4.5383 7.5436 4.6522 4.8444 5.0788 4.6683 6.2501 2.8428 3.3440 3.1609 2.6525 2.9644 2.7052 1.2072 1.8960 9.7388 2.8077 2.6711 8.2043 2.9678 2.0837 8.0239 2.3524 3.6445 4.7641 4.1553 3.8527 2.5192 2.3020 2.7166 6.3925 2.4774 1.8393 1.5972 1.6567 2.5760 2.5939 1.7949 1.7164 2.0560 1.9710 1.7431 3.5161 1.8700 2.1123 2.3548 2.2422 3.6928 2.7043 2.5319 1.8973 1.9753 1.9496 1.8429 1.0948 5.1753 1.4519 1.2650 1.1590 1.1636 3.7782 1.2680 1.2982 1.3349 1.3743 1.4238 1.9021 1.5439 3.0166 1.8293 1.4364 1.2866 1.0840 1.0957 1.0865 1.0891 1.0858 1.0569 1.0532 1.0936 6.9599 8.6680 7.3971 5.4229 1.0611 1.0621 1.0611 1.0622 1.0631 1.0632 1.0359 1.0976 1.0977 1.0998 1.1011 1.0990 1.1004 1.0980 1.1025 1.0890 1.0756 1.0780
irintensity: 0.5275 0.5294 0.2377 4.0791 0.3169 0.4172 7.4936 0.9269 0.5539 0.7025 1.6736 4.3843 1.9927 1.6548 3.7152 23.6178 2.5663 4.0794 2.0250 4.8752 1.5702 12.8762 9.0754 12.3110 3.0346 3.6558 1.5461 3.9224 10.2505 23.7080 8.5008 4.5178 0.6622 2.1178 232.7341 3.1911 19.4456 5.7057 1.0160 4.1639 5.5398 12.7292 1.3364 0.4147 0.6885 1.7352 2.5656 7.2330 7.5856 0.2858 2.5698 4.3705 1.8918 6.9276 1.8145 61.7093 12.3505 2.5418 0.2832 1.7750 337.0030 1.9003 4.3684 6.7568 0.5637 11.0235 90.2120 14.6210 146.4064 4.9638 4.3766 36.8680 5.3810 1.7496 4.4921 10.0841 8.6491 15.5521 8.2381 29.6990 311.4910 44.0754 13.7856 615.4076 28.4552 40.6956 13.0096 36.2656 24.6931 48.6713 13.7889 45.4729 24.4233 58.6289 46.3602 28.3559 80.3024 18.0780 2.7702 13.0058 82.0246 44.1409
temp: 298.150 k
press: 1.00000 atm
elementType: 8 8 8 7 7 6 6 6 6 6 6 6 6 6 6 6 6 6 1 1 1 1 1 1 1 1 1 1 1 1 1 1 1 1 1 1
symmnumber: 1
zpe: 781300.3 jmol-1
zpe.correction: 0.297582 hartree
zpe.thermalcorrener: 0.314364 hartree
zpe.thermalcorrenthalpy: 0.315308 hartree
zpe.thermalcorrgfe: 0.253301 hartree
zpe.sumelectzpe: -840.021167 hartree
zpe.sumelectthermal: -840.004384 hartree
zpe.sumelectthermalent: -840.003440 hartree
zpe.sumelectthermalfe: -840.065447 hartree
dipole: 1.8492 -0.0721 -0.1136
dipole: 1.8541
quadrupole: -108.5786 -113.4917 -111.1281
quadrupole: -2.3235 -5.2215 4.6889
quadrupole: 2.4875 -2.4255 -0.0620 -2.3235 -5.2215 4.6889
hfenergy: -840.3187482 hartree
pointgroup: C01 [X(C13H18N2O3)]
dipole: -0.7284293 -0.0270849 0.027543 debye
polarizability: 187.8986945|-13.7593239|154.2470496|19.6108063|-6.9992841|132.0972578 unknown
InChI: InChI=1S/C13H18N2O3/c1-13(9-7-5-3-2-4-6-8-9)10(16)14-12(18)15-11(13)17/h7,14-15H,2-6,8H2,1H3
charge 0 multiplicity 1
36 atoms
O  1.620619 2.644726 0.499484
O  0.50777 -1.42744 -1.936071
O  3.849168 -1.351433 1.286826
N  2.66263 0.623982 0.891371
N  2.12232 -1.350113 -0.288655
C  0.706355 0.701335 -0.712529
C  -0.689899 0.68424 -0.018538
C  -0.812384 -0.100438 1.281599
C  -1.255613 -1.589308 1.105665
C  -2.460717 -1.830113 0.163484
C  -3.777675 -1.090315 0.541535
C  -4.079239 0.211698 -0.246487
C  -3.142907 1.422105 0.050829
C  -1.756455 1.331142 -0.563056
C  0.738041 1.491312 -2.050964
C  1.681528 1.414465 0.257503
C  1.087622 -0.760335 -1.042608
C  2.939048 -0.737123 0.677303
H  0.138399 -0.086678 1.850789
H  -1.555775 0.402704 1.927238
H  -0.40435 -2.192639 0.735271
H  -1.495522 -1.982649 2.11457
H  -2.173134 -1.569194 -0.873135
H  -2.649796 -2.922013 0.159746
H  -3.786908 -0.870003 1.630129
H  -4.629732 -1.777471 0.367938
H  -5.116594 0.526543 -0.01128
H  -4.056569 -0.009613 -1.332361
H  -3.075563 1.546991 1.150291
H  -3.630257 2.336931 -0.337554
H  -1.637488 1.846411 -1.523343
H  0.46899 2.543713 -1.869804
H  1.752228 1.466681 -2.488206
H  0.043782 1.034207 -2.773305
H  3.27701 1.100443 1.560496
H  2.341767 -2.330848 -0.493874
