program: Orca
programVersion: 5.0.2
elementType: Cl S O O N N C C C C C C C C C C C C C C C C C C C H H H H H H H H H H H H H H H H H H H H H H H
charge: 0
multiplicity: 1
keywords: wb97x-d3
keywords: def2-TZVPP
keywords: def2/J RIJCOSX
keywords: DEFGRID2
keywords: scfconv7
keywords: smallprint printgap noloewdin
keywords: NOSOSCF
formula: C19H23ClN2O2S
InChI: InChI=1/C19H23ClN2O2S/c1-2-3-4-5-6-10-13-25-19(23)24-16-14-17(20)21-22-18(16)15-11-8-7-9-12-15/h7-9,11-12,14H,2-6,10,13H2,1H3
48 atoms
Cl -6.086181 -2.131563 -0.819611
S  1.015485 -1.524326 1.411364
O  -1.18494 -1.487809 0.1947
O  -1.134199 -0.0529 1.927495
N  -3.639692 0.77414 -1.195785
N  -4.715431 0.023656 -1.18921
C  4.532013 0.420275 1.827391
C  5.718668 0.656773 0.897494
C  3.209329 0.953997 1.287584
C  5.625134 -0.06412 -0.442317
C  2.065386 0.917544 2.293513
C  6.879034 0.101177 -1.292385
C  1.651239 -0.471982 2.752295
C  6.794556 -0.620148 -2.628618
C  -0.593755 -0.872929 1.248818
C  -2.37044 -0.986512 -0.257688
C  -2.474387 0.31718 -0.770684
C  -1.329941 1.244313 -0.847665
C  -0.118544 0.845658 -1.410474
C  -1.466864 2.542813 -0.360994
C  -3.478085 -1.787304 -0.249814
C  0.942296 1.736794 -1.479645
C  -0.400609 3.425772 -0.422953
C  0.806888 3.024207 -0.979612
C  -4.63727 -1.208493 -0.755103
H  4.739238 0.897974 2.790853
H  4.453228 -0.652442 2.033743
H  6.632501 0.335261 1.40772
H  5.833538 1.732614 0.724001
H  2.918773 0.407418 0.385949
H  3.348196 1.993063 0.972734
H  4.761038 0.300817 -1.007379
H  5.444086 -1.131096 -0.267419
H  2.353401 1.473338 3.191884
H  1.197783 1.438797 1.882487
H  7.061704 1.166655 -1.464634
H  7.745728 -0.267131 -0.734355
H  2.494059 -1.031942 3.16029
H  0.898547 -0.429015 3.539229
H  6.654682 -1.694736 -2.493344
H  7.702694 -0.480743 -3.217421
H  5.957715 -0.254044 -3.227248
H  -0.004196 -0.148944 -1.822424
H  -2.403704 2.856828 0.081142
H  -3.452118 -2.79925 0.131463
H  1.876081 1.422769 -1.927657
H  -0.512341 4.429458 -0.033879
H  1.638831 3.714995 -1.027425
elementType: Cl S O N C H
totalener: -1856.33246916 hartree
nucrepener: 2470.30161320 hartree
electener: -4326.63408235 hartree
oneelecener: -7452.56200056 hartree
twoeener: 3125.92791821 hartree
cpcmener: -0.02497761 hartree
kineticenergy: 1850.60545773 hartree
xcener: -138.234690894790 hartree
chargesum: -0.0000000
charge: -0.045911 -0.043804 -0.284972 -0.374375 -0.140978 -0.196554 -0.120874 -0.133633 -0.135539 -0.099782 -0.150693 -0.086751 -0.136816 -0.276483 0.351687 0.172743 0.243529 0.036340 -0.177873 -0.174885 -0.138164 -0.183854 -0.161895 -0.126868 0.152176 0.077360 0.064042 0.070359 0.061801 0.047837 0.084735 0.056301 0.055337 0.090563 0.080884 0.054109 0.055146 0.134794 0.131671 0.077371 0.089756 0.076526 0.155924 0.141687 0.154267 0.158988 0.155907 0.158866
qa: -0.0459 -0.0438 -0.2850 -0.3744 -0.1410 -0.1966 -0.1209 -0.1336 -0.1355 -0.0998 -0.1507 -0.0868 -0.1368 -0.2765 0.3517 0.1727 0.2435 0.0363 -0.1779 -0.1749 -0.1382 -0.1839 -0.1619 -0.1269 0.1522 0.0774 0.0640 0.0704 0.0618 0.0478 0.0847 0.0563 0.0553 0.0906 0.0809 0.0541 0.0551 0.1348 0.1317 0.0774 0.0898 0.0765 0.1559 0.1417 0.1543 0.1590 0.1559 0.1589
va: 1.2567 2.4051 2.1174 2.1285 2.9520 2.9398 3.9050 3.9059 3.8539 3.8589 3.8755 3.8858 3.8853 3.9461 4.2859 3.8747 3.8253 3.5495 3.8620 3.9809 4.0443 3.8666 3.9308 3.8474 4.2094 1.0114 1.0078 1.0113 1.0107 1.0181 1.0092 1.0066 1.0089 1.0116 1.0212 1.0063 1.0076 1.0022 1.0221 1.0008 1.0043 1.0014 1.0086 1.0168 1.0066 0.9939 0.9930 0.9917
dispcorr: -0.025879549 hartree
energy: -1856.358348704570
dipole: 80.77235 -78.01610 2.75626 15.47009 -16.23684 -0.76674 3.92636 -2.92006 1.00630
magnitude: 3.03274 au
magnitude: 7.70860 debye
