program: Orca
programVersion: 5.0.2
elementType: Cl S O O N N C C C C C C C C C C C C C C C C C C C H H H H H H H H H H H H H H H H H H H H H H H
charge: 0
multiplicity: 1
keywords: wb97x-d3
keywords: def2-TZVPP
keywords: def2/J RIJCOSX
keywords: DEFGRID2
keywords: scfconv7
keywords: smallprint printgap noloewdin
keywords: NOSOSCF
formula: C19H23ClN2O2S
InChI: InChI=1/C19H23ClN2O2S/c1-2-3-4-5-6-10-13-25-19(23)24-16-14-17(20)21-22-18(16)15-11-8-7-9-12-15/h7-9,11-12,14H,2-6,10,13H2,1H3
48 atoms
Cl -6.447009 -1.581493 -0.359418
S  0.89963 -2.406024 0.716816
O  -1.416833 -1.903332 -0.125845
O  -0.8339 -0.608443 1.619317
N  -3.580277 0.839135 -1.058179
N  -4.7648 0.298753 -0.902259
C  3.707882 1.971075 1.82851
C  4.537471 2.024574 0.547782
C  3.331345 0.572086 2.311772
C  5.917243 1.388674 0.666503
C  2.448939 -0.178974 1.32083
C  6.766259 1.577695 -0.584798
C  1.950077 -1.496488 1.890339
C  8.149264 0.955234 -0.466657
C  -0.567811 -1.470097 0.836984
C  -2.540367 -1.16842 -0.369813
C  -2.471387 0.157276 -0.828769
C  -1.201966 0.873277 -1.0568
C  -0.172627 0.303059 -1.803884
C  -1.039566 2.153839 -0.530735
C  -3.765499 -1.750934 -0.205826
C  1.00117 1.009609 -2.02224
C  0.138636 2.851159 -0.743412
C  1.161429 2.281046 -1.490203
C  -4.857192 -0.945852 -0.510692
H  2.787994 2.545903 1.678719
H  4.255938 2.484215 2.624883
H  4.657529 3.074638 0.261656
H  3.990419 1.556113 -0.277192
H  2.797888 0.667805 3.262377
H  4.229964 -0.013305 2.528339
H  5.823591 0.317981 0.875952
H  6.441219 1.820381 1.527061
H  1.599625 0.45357 1.050974
H  2.995963 -0.378813 0.396666
H  6.244623 1.147802 -1.445805
H  6.865392 2.647253 -0.795359
H  2.778571 -2.176922 2.095664
H  1.402274 -1.366591 2.824336
H  8.737528 1.109528 -1.372704
H  8.088982 -0.121512 -0.295222
H  8.71024 1.388039 0.36447
H  -0.291327 -0.678861 -2.244405
H  -1.83318 2.599278 0.0555
H  -3.874886 -2.767517 0.146276
H  1.791199 0.564146 -2.6123
H  0.258808 3.841613 -0.323941
H  2.079693 2.828768 -1.658769
elementType: Cl S O N C H
totalener: -1856.33294423 hartree
nucrepener: 2466.23228887 hartree
electener: -4322.56523310 hartree
oneelecener: -7444.40784116 hartree
twoeener: 3121.84260805 hartree
cpcmener: -0.02490299 hartree
kineticenergy: 1850.61103718 hartree
xcener: -138.235102147902 hartree
chargesum: 0.0000000
charge: -0.045848 -0.043546 -0.283507 -0.373454 -0.140596 -0.195757 -0.142749 -0.131210 -0.151343 -0.110853 -0.115105 -0.081816 -0.109876 -0.278075 0.340541 0.169251 0.252677 0.027689 -0.171899 -0.166435 -0.137008 -0.171275 -0.164029 -0.147364 0.151672 0.075741 0.080719 0.079372 0.048780 0.084037 0.077291 0.058324 0.059526 0.049326 0.078357 0.055712 0.054015 0.131612 0.117315 0.089522 0.077217 0.077468 0.156519 0.140303 0.153672 0.155062 0.155848 0.164174
qa: -0.0458 -0.0435 -0.2835 -0.3735 -0.1406 -0.1958 -0.1427 -0.1312 -0.1513 -0.1109 -0.1151 -0.0818 -0.1099 -0.2781 0.3405 0.1693 0.2527 0.0277 -0.1719 -0.1664 -0.1370 -0.1713 -0.1640 -0.1474 0.1517 0.0757 0.0807 0.0794 0.0488 0.0840 0.0773 0.0583 0.0595 0.0493 0.0784 0.0557 0.0540 0.1316 0.1173 0.0895 0.0772 0.0775 0.1565 0.1403 0.1537 0.1551 0.1558 0.1642
va: 1.2567 2.4088 2.1188 2.1270 2.9496 2.9378 3.8921 3.8746 3.9053 3.8673 3.8594 3.8800 3.9052 3.9472 4.2950 3.8838 3.8184 3.5394 3.8645 3.9783 4.0418 3.8666 3.9115 3.8364 4.2096 1.0108 1.0093 1.0089 1.0065 1.0104 1.0025 1.0055 1.0101 1.0246 1.0103 1.0056 1.0083 1.0082 1.0251 1.0044 1.0011 1.0010 1.0076 1.0169 1.0067 0.9960 0.9942 0.9844
dispcorr: -0.026284040 hartree
energy: -1856.359228273158
dipole: 84.17488 -81.56027 2.61460 22.49711 -23.71997 -1.22286 8.55819 -8.06291 0.49528
magnitude: 2.92863 au
magnitude: 7.44397 debye
