program: Orca
programVersion: 5.0.2
elementType: Cl S O O N N C C C C C C C C C C C C C C C C C C C H H H H H H H H H H H H H H H H H H H H H H H
charge: 0
multiplicity: 1
keywords: wb97x-d3
keywords: def2-TZVPP
keywords: def2/J RIJCOSX
keywords: DEFGRID2
keywords: scfconv7
keywords: smallprint printgap noloewdin
keywords: NOSOSCF
formula: C19H23ClN2O2S
InChI: InChI=1/C19H23ClN2O2S/c1-2-3-4-5-6-10-13-25-19(23)24-16-14-17(20)21-22-18(16)15-11-8-7-9-12-15/h7-9,11-12,14H,2-6,10,13H2,1H3
48 atoms
Cl -6.513432 -1.245388 -0.026934
S  0.720832 -2.918074 0.524008
O  -1.558598 -2.175515 -0.247554
O  -0.695303 -0.821831 1.328517
N  -3.470474 0.741083 -1.199632
N  -4.687735 0.366119 -0.884974
C  4.183296 1.078676 0.751939
C  5.258082 1.84506 1.510499
C  3.62861 -0.113365 1.520736
C  5.784078 3.043878 0.730846
C  2.550921 -0.842527 0.729815
C  6.900813 3.811975 1.431394
C  1.971961 -2.0213 1.4917
C  6.478121 4.463203 2.740839
C  -0.599464 -1.78166 0.624067
C  -2.610414 -1.329837 -0.452539
C  -2.432523 -0.057918 -1.021437
C  -1.11431 0.466074 -1.42762
C  -0.257811 -0.284444 -2.231863
C  -0.726438 1.738601 -1.011746
C  -3.870723 -1.742354 -0.125983
C  0.970055 0.235785 -2.614495
C  0.506246 2.249115 -1.387278
C  1.356878 1.498863 -2.189404
C  -4.885168 -0.827505 -0.386758
H  4.588776 0.735053 -0.206263
H  3.361199 1.759907 0.505258
H  6.090503 1.171618 1.744368
H  4.850259 2.170217 2.472794
H  3.21481 0.227696 2.475483
H  4.440987 -0.805502 1.766071
H  4.955293 3.728435 0.517117
H  6.147863 2.699293 -0.242711
H  1.756822 -0.135608 0.478912
H  2.965443 -1.196463 -0.217843
H  7.745914 3.140219 1.613263
H  7.274036 4.585492 0.754313
H  2.738501 -2.770182 1.701327
H  1.537635 -1.72973 2.448642
H  5.627142 5.132638 2.593837
H  7.289752 5.055567 3.167003
H  6.189516 3.727495 3.493266
H  -0.553457 -1.263809 -2.586768
H  -1.385726 2.322785 -0.381862
H  -4.062019 -2.711496 0.314917
H  1.624873 -0.349025 -3.247748
H  0.803575 3.234533 -1.052207
H  2.318697 1.899596 -2.482789
elementType: Cl S O N C H
totalener: -1856.33401961 hartree
nucrepener: 2430.87875452 hartree
electener: -4287.21277413 hartree
oneelecener: -7373.87010282 hartree
twoeener: 3086.65732869 hartree
cpcmener: -0.02483449 hartree
kineticenergy: 1850.61090140 hartree
xcener: -138.233464946876 hartree
chargesum: 0.0000000
charge: -0.045742 -0.044994 -0.285025 -0.375144 -0.141362 -0.195256 -0.096633 -0.125803 -0.123506 -0.108119 -0.104810 -0.113715 -0.110255 -0.276852 0.345049 0.169513 0.254207 0.027791 -0.175551 -0.168869 -0.137292 -0.166655 -0.157070 -0.146792 0.152939 0.062768 0.050773 0.059243 0.061753 0.067291 0.066410 0.061187 0.065549 0.042444 0.077152 0.053940 0.069144 0.129261 0.116627 0.079230 0.090878 0.079253 0.153016 0.140917 0.154274 0.154496 0.155982 0.158357
qa: -0.0457 -0.0450 -0.2850 -0.3751 -0.1414 -0.1953 -0.0966 -0.1258 -0.1235 -0.1081 -0.1048 -0.1137 -0.1103 -0.2769 0.3450 0.1695 0.2542 0.0278 -0.1756 -0.1689 -0.1373 -0.1667 -0.1571 -0.1468 0.1529 0.0628 0.0508 0.0592 0.0618 0.0673 0.0664 0.0612 0.0655 0.0424 0.0772 0.0539 0.0691 0.1293 0.1166 0.0792 0.0909 0.0793 0.1530 0.1409 0.1543 0.1545 0.1560 0.1584
va: 1.2567 2.4079 2.1201 2.1261 2.9507 2.9388 3.8895 3.9027 3.9214 3.8780 3.8814 3.8995 3.9081 3.9275 4.2853 3.8784 3.8123 3.5430 3.8753 3.9724 4.0477 3.8718 3.8940 3.8405 4.2081 1.0086 1.0109 1.0095 1.0073 1.0096 1.0115 1.0085 1.0121 1.0263 1.0132 1.0086 1.0070 1.0090 1.0235 1.0006 1.0045 0.9986 1.0089 1.0166 1.0065 0.9949 0.9940 0.9904
dispcorr: -0.025019658 hartree
energy: -1856.359039270068
dipole: 83.28086 -80.76386 2.51700 30.55924 -32.08744 -1.52821 14.48079 -14.11723 0.36356
magnitude: 2.96696 au
magnitude: 7.54142 debye
