program: Orca
programVersion: 5.0.2
elementType: Cl S O O N N C C C C C C C C C C C C C C C C C C C H H H H H H H H H H H H H H H H H H H H H H H
charge: 0
multiplicity: 1
keywords: wb97x-d3
keywords: def2-TZVPP
keywords: def2/J RIJCOSX
keywords: DEFGRID2
keywords: scfconv7
keywords: smallprint printgap noloewdin
keywords: NOSOSCF
formula: C19H23ClN2O2S
InChI: InChI=1/C19H23ClN2O2S/c1-2-3-4-5-6-10-13-25-19(23)24-16-14-17(20)21-22-18(16)15-11-8-7-9-12-15/h7-9,11-12,14H,2-6,10,13H2,1H3
48 atoms
Cl -5.781337 -1.504462 -1.638966
S  0.884675 -2.693314 1.235952
O  -1.334989 -1.656165 0.746426
O  0.074455 -1.484398 -0.997976
N  -3.16034 1.108123 -0.703451
N  -4.22247 0.499973 -1.171257
C  3.666365 -0.150096 -0.109081
C  4.084837 1.300987 0.088756
C  3.71169 -0.957487 1.183237
C  3.922368 2.144047 -1.169866
C  3.634303 -2.464664 0.979719
C  4.256802 3.620914 -0.983984
C  2.395361 -2.965444 0.253087
C  5.713222 3.887688 -0.631417
C  -0.149264 -1.843948 0.118596
C  -2.297355 -0.941312 0.091171
C  -2.201869 0.449038 -0.071238
C  -1.06878 1.256986 0.416761
C  -0.530505 1.06952 1.689982
C  -0.563675 2.272179 -0.3950
C  -3.399544 -1.59459 -0.385391
C  0.492695 1.890546 2.14073
C  0.46159 3.086318 0.058201
C  0.989119 2.900553 1.329238
C  -4.348496 -0.792869 -1.009637
H  4.320511 -0.614598 -0.855932
H  2.656137 -0.178143 -0.529942
H  5.124695 1.325543 0.429547
H  3.491009 1.742637 0.89657
H  2.908876 -0.625754 1.849249
H  4.645045 -0.742765 1.712491
H  2.888674 2.057047 -1.520612
H  4.546648 1.730319 -1.970243
H  4.493517 -2.793819 0.386711
H  3.724406 -2.974034 1.943005
H  4.008975 4.157647 -1.904155
H  3.611655 4.043861 -0.206548
H  2.266519 -2.48683 -0.716818
H  2.464051 -4.038918 0.079086
H  5.916661 4.958515 -0.577557
H  6.386098 3.46454 -1.380695
H  5.987441 3.459817 0.333987
H  -0.928718 0.314405 2.354769
H  -0.972135 2.423369 -1.385622
H  -3.517143 -2.665393 -0.287214
H  0.893561 1.746647 3.135602
H  0.845792 3.870755 -0.580776
H  1.783268 3.542751 1.687282
elementType: Cl S O N C H
totalener: -1856.33057380 hartree
nucrepener: 2511.45042284 hartree
electener: -4367.78099664 hartree
oneelecener: -7535.12938475 hartree
twoeener: 3167.34838811 hartree
cpcmener: -0.02444411 hartree
kineticenergy: 1850.60811298 hartree
xcener: -138.235493915439 hartree
chargesum: 0.0000000
charge: -0.045279 -0.044846 -0.289490 -0.383888 -0.142983 -0.195369 -0.107571 -0.156495 -0.124792 -0.132481 -0.148636 -0.108189 -0.135880 -0.277654 0.358159 0.160018 0.258587 0.037198 -0.180975 -0.157430 -0.123571 -0.184586 -0.192089 -0.127102 0.150198 0.075060 0.049183 0.083268 0.064216 0.062812 0.076139 0.072426 0.079449 0.082433 0.091386 0.072808 0.045275 0.121562 0.132937 0.091105 0.080953 0.079319 0.155987 0.139845 0.153724 0.155497 0.161599 0.168162
qa: -0.0453 -0.0448 -0.2895 -0.3839 -0.1430 -0.1954 -0.1076 -0.1565 -0.1248 -0.1325 -0.1486 -0.1082 -0.1359 -0.2777 0.3582 0.1600 0.2586 0.0372 -0.1810 -0.1574 -0.1236 -0.1846 -0.1921 -0.1271 0.1502 0.0751 0.0492 0.0833 0.0642 0.0628 0.0761 0.0724 0.0794 0.0824 0.0914 0.0728 0.0453 0.1216 0.1329 0.0911 0.0810 0.0793 0.1560 0.1398 0.1537 0.1555 0.1616 0.1682
va: 1.2573 2.4153 2.1070 2.1160 2.9498 2.9386 3.8321 3.8749 3.8579 3.8688 3.9021 3.8864 3.8904 3.9343 4.2754 3.8808 3.8157 3.5555 3.8740 3.9841 4.0485 3.8889 3.8870 3.8081 4.2076 1.0135 1.0178 1.0094 1.0091 1.0202 1.0155 1.0086 1.0089 1.0089 1.0109 1.0071 1.0121 1.0202 1.0071 1.0045 1.0006 0.9988 1.0082 1.0208 1.0057 0.9960 0.9909 0.9830
dispcorr: -0.027094839 hartree
energy: -1856.357668642703
dipole: 71.40050 -69.14747 2.25303 22.40047 -23.93153 -1.53106 5.00681 -3.71242 1.29439
magnitude: 3.01591 au
magnitude: 7.66584 debye
