program: Orca
programVersion: 5.0.2
elementType: Cl S O O N N C C C C C C C C C C C C C C C C C C C H H H H H H H H H H H H H H H H H H H H H H H
charge: 0
multiplicity: 1
keywords: wb97x-d3
keywords: def2-TZVPP
keywords: def2/J RIJCOSX
keywords: DEFGRID2
keywords: scfconv7
keywords: smallprint printgap noloewdin
keywords: NOSOSCF
formula: C19H23ClN2O2S
InChI: InChI=1/C19H23ClN2O2S/c1-2-3-4-5-6-10-13-25-19(23)24-16-14-17(20)21-22-18(16)15-11-8-7-9-12-15/h7-9,11-12,14H,2-6,10,13H2,1H3
48 atoms
Cl -6.140008 -1.751852 -0.968132
S  0.695897 -2.111232 1.912246
O  -1.562183 -1.345543 1.116438
O  -0.158586 -1.800003 -0.582803
N  -3.270509 0.746322 -1.288789
N  -4.402721 0.101157 -1.433445
C  4.246326 0.858295 1.23601
C  5.416278 0.660955 0.279945
C  3.568469 -0.434353 1.680151
C  6.17967 1.947296 -0.027592
C  2.977505 -1.244087 0.533448
C  5.343199 3.064081 -0.649738
C  2.219685 -2.479862 0.989507
C  4.665911 2.674099 -1.955587
C  -0.374394 -1.730537 0.589426
C  -2.514095 -0.868291 0.261929
C  -2.330456 0.320744 -0.461412
C  -1.110955 1.145595 -0.372199
C  -0.511947 1.603718 -1.544162
C  -0.565866 1.500453 0.86107
C  -3.691874 -1.549657 0.133476
C  0.621278 2.398993 -1.484053
C  0.563661 2.303684 0.916073
C  1.15999 2.753077 -0.254034
C  -4.616417 -0.988096 -0.740113
H  3.494678 1.50581 0.774864
H  4.59771 1.392508 2.125135
H  5.065822 0.212255 -0.653959
H  6.114604 -0.063894 0.712176
H  2.77666 -0.181778 2.392483
H  4.284001 -1.05744 2.227644
H  7.01055 1.711148 -0.700476
H  6.636958 2.320582 0.894649
H  2.331022 -0.612214 -0.082563
H  3.77544 -1.596505 -0.125906
H  4.588756 3.409423 0.063383
H  5.993032 3.925517 -0.828023
H  1.963274 -3.135049 0.157423
H  2.820508 -3.071163 1.683572
H  3.937878 1.872086 -1.820826
H  5.395111 2.330864 -2.693217
H  4.136426 3.522041 -2.393445
H  -0.927372 1.328189 -2.504961
H  -1.033968 1.181593 1.783654
H  -3.882469 -2.469061 0.670528
H  1.082788 2.745046 -2.399773
H  0.973933 2.58358 1.877634
H  2.041055 3.380702 -0.207424
elementType: Cl S O N C H
totalener: -1856.33167709 hartree
nucrepener: 2503.38497685 hartree
electener: -4359.71665394 hartree
oneelecener: -7518.76894982 hartree
twoeener: 3159.05229588 hartree
cpcmener: -0.02486476 hartree
kineticenergy: 1850.60477222 hartree
xcener: -138.236635994127 hartree
chargesum: 0.0000000
charge: -0.045875 -0.048717 -0.287572 -0.378763 -0.141840 -0.195209 -0.096002 -0.126296 -0.149273 -0.154432 -0.126353 -0.109011 -0.127210 -0.293006 0.353568 0.167628 0.255922 0.024899 -0.167468 -0.170580 -0.134970 -0.171452 -0.199122 -0.120864 0.151111 0.019230 0.080581 0.069840 0.075641 0.072969 0.078400 0.074374 0.069127 0.067098 0.089514 0.055869 0.075482 0.131023 0.127256 0.069883 0.093750 0.099249 0.140297 0.157077 0.154464 0.156855 0.156211 0.176695
qa: -0.0459 -0.0487 -0.2876 -0.3788 -0.1418 -0.1952 -0.0960 -0.1263 -0.1493 -0.1544 -0.1264 -0.1090 -0.1272 -0.2930 0.3536 0.1676 0.2559 0.0249 -0.1675 -0.1706 -0.1350 -0.1715 -0.1991 -0.1209 0.1511 0.0192 0.0806 0.0698 0.0756 0.0730 0.0784 0.0744 0.0691 0.0671 0.0895 0.0559 0.0755 0.1310 0.1273 0.0699 0.0938 0.0992 0.1403 0.1571 0.1545 0.1569 0.1562 0.1767
va: 1.2564 2.4058 2.1159 2.1229 2.9483 2.9376 3.8678 3.8644 3.8781 3.9140 3.8672 3.8507 3.9016 3.9315 4.2769 3.8748 3.8164 3.5508 3.9976 3.8633 4.0455 3.9318 3.8994 3.8098 4.2090 1.0299 1.0134 0.9985 1.0111 1.0208 1.0129 1.0083 1.0109 1.0166 1.0109 1.0086 1.0102 1.0206 1.0076 0.9944 1.0057 1.0010 1.0182 1.0070 1.0061 0.9943 0.9959 0.9756
dispcorr: -0.027700215 hartree
energy: -1856.359377309793
dipole: 76.88229 -74.59443 2.28786 22.47807 -23.35216 -0.87409 2.22382 -0.49709 1.72674
magnitude: 2.99666 au
magnitude: 7.61690 debye
