program: Orca
programVersion: 5.0.2
elementType: Cl S O O N N C C C C C C C C C C C C C C C C C C C H H H H H H H H H H H H H H H H H H H H H H H
charge: 0
multiplicity: 1
keywords: wb97x-d3
keywords: def2-TZVPP
keywords: def2/J RIJCOSX
keywords: DEFGRID2
keywords: scfconv7
keywords: smallprint printgap noloewdin
keywords: NOSOSCF
formula: C19H23ClN2O2S
InChI: InChI=1/C19H23ClN2O2S/c1-2-3-4-5-6-10-13-25-19(23)24-16-14-17(20)21-22-18(16)15-11-8-7-9-12-15/h7-9,11-12,14H,2-6,10,13H2,1H3
48 atoms
Cl -6.242366 -0.435417 0.808674
S  0.393928 2.148481 -1.45273
O  -1.814935 0.996306 -1.138014
O  -0.229743 0.215243 0.258073
N  -3.307283 -2.281603 -0.786136
N  -4.442868 -1.985584 -0.201544
C  3.96261 0.839314 1.519378
C  5.344337 0.647756 2.141056
C  3.615093 2.293348 1.212895
C  5.494696 1.243399 3.535893
C  2.205975 2.498225 0.658312
C  6.860091 0.978951 4.158512
C  2.022113 1.850172 -0.703273
C  6.998878 1.579947 5.548981
C  -0.563932 0.95637 -0.615611
C  -2.689293 0.000543 -0.813785
C  -2.432294 -1.347359 -1.11757
C  -1.187789 -1.806756 -1.761902
C  -0.678672 -1.179882 -2.89774
C  -0.501253 -2.88602 -1.208291
C  -3.872009 0.330272 -0.212058
C  0.514189 -1.616247 -3.456038
C  0.69068 -3.316037 -1.767822
C  1.204757 -2.677712 -2.888894
C  -4.723525 -0.734478 0.06054
H  3.202525 0.418679 2.187402
H  3.914395 0.24848 0.60035
H  6.103645 1.075378 1.476518
H  5.559875 -0.424363 2.190881
H  4.347003 2.702142 0.507421
H  3.703809 2.89444 2.121111
H  4.7148 0.833423 4.187903
H  5.325179 2.324195 3.505229
H  1.473916 2.100915 1.365322
H  2.006997 3.568792 0.570172
H  7.036401 -0.10027 4.206786
H  7.640568 1.383595 3.506301
H  2.72495 2.269614 -1.426621
H  2.187238 0.773353 -0.689948
H  6.255936 1.168705 6.235621
H  6.86111 2.663054 5.529162
H  7.983424 1.38326 5.976388
H  -1.216102 -0.364791 -3.365593
H  -0.890787 -3.375421 -0.324917
H  -4.119988 1.351597 0.043622
H  0.902082 -1.12446 -4.338524
H  1.22281 -4.146934 -1.323217
H  2.139855 -3.009425 -3.321405
elementType: Cl S O N C H
totalener: -1856.33239848 hartree
nucrepener: 2387.54495700 hartree
electener: -4243.87735548 hartree
oneelecener: -7287.27942126 hartree
twoeener: 3043.40206578 hartree
cpcmener: -0.02530040 hartree
kineticenergy: 1850.60552447 hartree
xcener: -138.232944697075 hartree
chargesum: -0.0000000
charge: -0.046129 -0.044061 -0.284185 -0.379064 -0.139524 -0.197053 -0.125765 -0.137399 -0.125737 -0.105385 -0.173001 -0.088102 -0.098904 -0.276196 0.344845 0.181138 0.237448 0.026508 -0.172896 -0.175987 -0.142614 -0.180222 -0.172272 -0.119359 0.153363 0.065456 0.075190 0.060840 0.072121 0.068441 0.080339 0.057120 0.058014 0.086500 0.086614 0.055111 0.054525 0.132878 0.114006 0.077514 0.076599 0.090111 0.161388 0.140738 0.153821 0.156453 0.157277 0.159499
qa: -0.0461 -0.0441 -0.2842 -0.3791 -0.1395 -0.1971 -0.1258 -0.1374 -0.1257 -0.1054 -0.1730 -0.0881 -0.0989 -0.2762 0.3448 0.1811 0.2374 0.0265 -0.1729 -0.1760 -0.1426 -0.1802 -0.1723 -0.1194 0.1534 0.0655 0.0752 0.0608 0.0721 0.0684 0.0803 0.0571 0.0580 0.0865 0.0866 0.0551 0.0545 0.1329 0.1140 0.0775 0.0766 0.0901 0.1614 0.1407 0.1538 0.1565 0.1573 0.1595
va: 1.2561 2.4196 2.1185 2.1156 2.9454 2.9386 3.8890 3.9131 3.8907 3.8595 3.9124 3.8849 3.8759 3.9449 4.2904 3.8694 3.8438 3.5681 3.8651 3.9811 4.0432 3.9164 3.9425 3.8788 4.2089 1.0096 1.0126 1.0091 1.0093 1.0080 1.0123 1.0083 1.0081 1.0191 1.0171 1.0077 1.0066 1.0081 1.0212 1.0009 1.0014 1.0043 1.0062 1.0180 1.0073 0.9943 0.9929 0.9891
dispcorr: -0.022731935 hartree
energy: -1856.355130418705
dipole: 82.63543 -80.46864 2.16679 14.24810 -12.19928 2.04881 26.50915 -27.12549 -0.61634
magnitude: 3.04508 au
magnitude: 7.73997 debye
