program: Orca
programVersion: 5.0.2
elementType: Cl S O O N N C C C C C C C C C C C C C C C C C C C H H H H H H H H H H H H H H H H H H H H H H H
charge: 0
multiplicity: 1
keywords: wb97x-d3
keywords: def2-TZVPP
keywords: def2/J RIJCOSX
keywords: DEFGRID2
keywords: scfconv7
keywords: smallprint printgap noloewdin
keywords: NOSOSCF
formula: C19H23ClN2O2S
InChI: InChI=1/C19H23ClN2O2S/c1-2-3-4-5-6-10-13-25-19(23)24-16-14-17(20)21-22-18(16)15-11-8-7-9-12-15/h7-9,11-12,14H,2-6,10,13H2,1H3
48 atoms
Cl -5.661318 0.008586 1.217935
S  1.043367 -3.072354 0.34874
O  -1.185007 -1.957595 -0.018812
O  0.270056 -0.637637 1.071773
N  -2.751101 1.163557 -0.9658
N  -3.884989 1.091431 -0.311182
C  4.439322 0.156925 1.408529
C  3.524396 1.291858 0.96131
C  4.624886 -0.937451 0.358342
C  3.568486 2.498204 1.891853
C  3.33532 -1.584571 -0.141581
C  2.579989 3.599654 1.516116
C  2.620819 -2.383191 0.936686
C  1.127083 3.245236 1.801361
C  0.01653 -1.674802 0.536382
C  -2.090984 -0.939831 -0.115107
C  -1.853862 0.193421 -0.911734
C  -0.618752 0.395442 -1.691999
C  -0.079628 -0.621411 -2.479287
C  0.013527 1.637421 -1.650289
C  -3.272764 -1.041128 0.562613
C  1.083851 -0.399377 -3.20115
C  1.179523 1.851707 -2.367562
C  1.720103 0.832351 -3.14049
C  -4.145525 0.030399 0.408981
H  4.05848 -0.270218 2.341917
H  5.426243 0.563299 1.652481
H  2.498946 0.924176 0.884431
H  3.806071 1.612643 -0.048751
H  5.290464 -1.711651 0.753143
H  5.141891 -0.509704 -0.505805
H  4.583958 2.906765 1.888712
H  3.376095 2.177183 2.922166
H  2.667881 -0.819155 -0.543717
H  3.568081 -2.251826 -0.974727
H  2.832886 4.512033 2.063523
H  2.698155 3.844788 0.455343
H  3.209683 -3.252744 1.235031
H  2.42496 -1.807027 1.840457
H  0.455655 4.051639 1.501266
H  0.969328 3.070053 2.867909
H  0.806745 2.345387 1.273711
H  -0.575324 -1.58051 -2.557117
H  -0.400617 2.432239 -1.043292
H  -3.502419 -1.892028 1.189769
H  1.491937 -1.192877 -3.813577
H  1.668813 2.81594 -2.320625
H  2.632843 0.999467 -3.697785
elementType: Cl S O N C H
totalener: -1856.33156440 hartree
nucrepener: 2567.79222266 hartree
electener: -4424.12378706 hartree
oneelecener: -7648.03805721 hartree
twoeener: 3223.91427015 hartree
cpcmener: -0.02415501 hartree
kineticenergy: 1850.60583883 hartree
xcener: -138.235962524203 hartree
chargesum: -0.0000000
charge: -0.045421 -0.045312 -0.286438 -0.382816 -0.139489 -0.197758 -0.145640 -0.060257 -0.154297 -0.119200 -0.095691 -0.103484 -0.107354 -0.258520 0.359610 0.168192 0.246259 0.054533 -0.167572 -0.193898 -0.131556 -0.196772 -0.195267 -0.089985 0.153992 0.069319 0.071051 0.018495 0.059411 0.080057 0.078012 0.068453 0.058023 0.008604 0.098064 0.073219 0.050822 0.133579 0.116008 0.093303 0.085915 0.046020 0.156121 0.147191 0.152142 0.155041 0.156904 0.158386
qa: -0.0454 -0.0453 -0.2864 -0.3828 -0.1395 -0.1978 -0.1456 -0.0603 -0.1543 -0.1192 -0.0957 -0.1035 -0.1074 -0.2585 0.3596 0.1682 0.2463 0.0545 -0.1676 -0.1939 -0.1316 -0.1968 -0.1953 -0.0900 0.1540 0.0693 0.0711 0.0185 0.0594 0.0801 0.0780 0.0685 0.0580 0.0086 0.0981 0.0732 0.0508 0.1336 0.1160 0.0933 0.0859 0.0460 0.1561 0.1472 0.1521 0.1550 0.1569 0.1584
va: 1.2575 2.4143 2.1192 2.1114 2.9465 2.9415 3.8994 3.8373 3.9452 3.9072 3.8882 3.8892 3.8756 3.9329 4.2608 3.8889 3.8086 3.5293 3.8607 3.9248 4.0484 3.8947 3.9092 3.8185 4.2068 1.0041 1.0129 1.0063 1.0112 1.0087 1.0083 1.0108 1.0073 1.0237 1.0158 1.0067 1.0103 1.0084 1.0249 1.0042 1.0057 1.0004 1.0087 1.0151 1.0071 0.9951 0.9944 0.9884
dispcorr: -0.028807895 hartree
energy: -1856.360372291655
dipole: 59.55150 -57.35103 2.20047 16.88668 -18.85241 -1.96573 5.43959 -5.34662 0.09297
magnitude: 2.95208 au
magnitude: 7.50359 debye
