program: Orca
programVersion: 5.0.2
elementType: Cl S O O N N C C C C C C C C C C C C C C C C C C C H H H H H H H H H H H H H H H H H H H H H H H
charge: 0
multiplicity: 1
keywords: wb97x-d3
keywords: def2-TZVPP
keywords: def2/J RIJCOSX
keywords: DEFGRID2
keywords: scfconv7
keywords: smallprint printgap noloewdin
keywords: NOSOSCF
formula: C19H23ClN2O2S
InChI: InChI=1/C19H23ClN2O2S/c1-2-3-4-5-6-10-13-25-19(23)24-16-14-17(20)21-22-18(16)15-11-8-7-9-12-15/h7-9,11-12,14H,2-6,10,13H2,1H3
48 atoms
Cl -5.562129 -2.027758 -1.484373
S  0.657444 -2.033356 2.324827
O  -1.419185 -1.135614 1.252822
O  0.033335 -1.950054 -0.265212
N  -3.013569 0.809308 -1.349762
N  -4.021841 0.043402 -1.670243
C  4.732884 -0.275862 0.607723
C  4.925848 0.707872 -0.541946
C  3.390263 -1.001031 0.609869
C  3.928798 1.859514 -0.550534
C  3.371206 -2.124952 1.635578
C  4.175191 2.884314 -1.655047
C  2.090339 -2.942425 1.669156
C  5.478473 3.659014 -1.508071
C  -0.251641 -1.71092 0.864019
C  -2.287099 -0.745001 0.270955
C  -2.145832 0.476588 -0.402556
C  -1.069005 1.453181 -0.150285
C  -0.59129 2.210067 -1.220616
C  -0.55886 1.692176 1.125616
C  -3.345178 -1.554108 -0.041283
C  0.379309 3.175258 -1.020673
C  0.412339 2.662162 1.320882
C  0.884927 3.404832 0.25096
C  -4.198672 -1.087458 -1.033036
H  4.861478 0.249421 1.560448
H  5.536445 -1.01846 0.566746
H  4.861637 0.169359 -1.493967
H  5.945128 1.099798 -0.486683
H  3.190489 -1.412492 -0.384807
H  2.579742 -0.296565 0.816662
H  3.951056 2.364998 0.422323
H  2.914762 1.467218 -0.658492
H  4.187359 -2.822028 1.418319
H  3.578091 -1.724672 2.63254
H  4.15254 2.382565 -2.627276
H  3.341778 3.592037 -1.668217
H  1.828456 -3.318457 0.679959
H  2.203037 -3.804426 2.327332
H  5.57124 4.426122 -2.277451
H  6.353172 3.013292 -1.591817
H  5.532214 4.158555 -0.538488
H  -0.992475 2.040696 -2.210081
H  -0.936124 1.155251 1.984126
H  -3.501357 -2.503871 0.450837
H  0.742119 3.751115 -1.861739
H  0.791739 2.842088 2.317856
H  1.645205 4.159249 0.405875
totalener: -1856.30733882 hartree
nucrepener: 2490.62704153 hartree
electener: -4346.93438036 hartree
oneelecener: -7493.12565252 hartree
twoeener: 3146.19127216 hartree
kineticenergy: 1850.64727849 hartree
xcener: -138.237401567985 hartree
chargesum: -0.0000000
charge: -0.037762 -0.037474 -0.299135 -0.314075 -0.105711 -0.154953 -0.121321 -0.137712 -0.091960 -0.098328 -0.125252 -0.106266 -0.143606 -0.255283 0.312544 0.134066 0.207802 0.077945 -0.122857 -0.199282 -0.139463 -0.136731 -0.114882 -0.128407 0.145191 0.062729 0.066678 0.062552 0.071953 0.074453 0.041641 0.053012 0.067545 0.070357 0.071109 0.060793 0.048647 0.112115 0.125153 0.086343 0.075587 0.073176 0.124686 0.131658 0.131618 0.129025 0.125243 0.126836
qa: -0.0378 -0.0375 -0.2991 -0.3141 -0.1057 -0.1550 -0.1213 -0.1377 -0.0920 -0.0983 -0.1253 -0.1063 -0.1436 -0.2553 0.3125 0.1341 0.2078 0.0779 -0.1229 -0.1993 -0.1395 -0.1367 -0.1149 -0.1284 0.1452 0.0627 0.0667 0.0626 0.0720 0.0745 0.0416 0.0530 0.0675 0.0704 0.0711 0.0608 0.0486 0.1121 0.1252 0.0863 0.0756 0.0732 0.1247 0.1317 0.1316 0.1290 0.1252 0.1268
va: 1.2620 2.3904 2.0942 2.1767 2.9586 2.9615 3.8922 3.9278 3.8598 3.8682 3.8840 3.8933 3.9163 3.9388 4.3062 3.8910 3.8834 3.6074 4.0326 3.9540 4.0801 3.9096 3.9370 3.9097 4.1931 1.0106 1.0127 1.0091 1.0144 1.0145 1.0194 1.0061 1.0085 1.0127 1.0129 1.0097 1.0154 1.0295 1.0068 1.0063 1.0034 1.0023 1.0289 1.0173 1.0161 1.0017 1.0036 0.9976
dispcorr: -0.025865145 hartree
energy: -1856.333203966938
dipole: 71.27957 -69.77277 1.50680 21.54593 -22.14012 -0.59419 1.82930 -0.57322 1.25609
magnitude: 2.04970 au
magnitude: 5.20991 debye
