program: Orca
programVersion: 5.0.2
elementType: Cl S O O N N C C C C C C C C C C C C C C C C C C C H H H H H H H H H H H H H H H H H H H H H H H
charge: 0
multiplicity: 1
keywords: wb97x-d3
keywords: def2-TZVPP
keywords: def2/J RIJCOSX
keywords: DEFGRID2
keywords: scfconv7
keywords: smallprint printgap noloewdin
keywords: NOSOSCF
formula: C19H23ClN2O2S
InChI: InChI=1/C19H23ClN2O2S/c1-2-3-4-5-6-10-13-25-19(23)24-16-14-17(20)21-22-18(16)15-11-8-7-9-12-15/h7-9,11-12,14H,2-6,10,13H2,1H3
48 atoms
Cl -6.314269 -1.529333 -0.560169
S  0.942126 -2.716139 0.535655
O  -1.293304 -1.94296 -0.31549
O  -0.833522 -1.155485 1.747154
N  -3.425032 0.965521 -0.629239
N  -4.614501 0.419507 -0.621167
C  4.268487 0.572849 0.949074
C  5.284463 0.731272 -0.175957
C  3.558706 -0.773864 0.911432
C  6.06839 2.039766 -0.141825
C  2.508841 -0.915039 2.004127
C  5.222058 3.28677 -0.37035
C  1.845106 -2.282024 2.052324
C  6.052275 4.560986 -0.429311
C  -0.520509 -1.794168 0.793921
C  -2.405336 -1.157251 -0.415717
C  -2.321954 0.237365 -0.549546
C  -1.046774 0.978199 -0.579327
C  0.03609 0.545598 -1.342248
C  -0.937155 2.16037 0.149178
C  -3.639771 -1.746086 -0.416459
C  1.209501 1.283748 -1.37012
C  0.238987 2.889521 0.125658
C  1.31506 2.454609 -0.635131
C  -4.723677 -0.882726 -0.536881
H  3.517307 1.36587 0.897177
H  4.773762 0.695909 1.913514
H  4.772833 0.641442 -1.141302
H  5.989833 -0.104604 -0.135759
H  4.297036 -1.578773 1.002429
H  3.084504 -0.903447 -0.066031
H  6.850459 2.002313 -0.906567
H  6.591779 2.127161 0.816477
H  2.974244 -0.750421 2.981591
H  1.74714 -0.139287 1.897086
H  4.66214 3.172473 -1.304946
H  4.474773 3.381163 0.422573
H  2.589107 -3.074169 2.158374
H  1.157851 -2.367036 2.893377
H  5.428573 5.439546 -0.594624
H  6.783527 4.519699 -1.23811
H  6.60129 4.717821 0.500487
H  -0.03674 -0.350833 -1.943346
H  -1.7794 2.502689 0.734594
H  -3.76412 -2.815109 -0.315512
H  2.040647 0.945438 -1.974928
H  0.314155 3.804011 0.6987
H  2.23082 3.030585 -0.661659
totalener: -1856.31014853 hartree
nucrepener: 2479.73801685 hartree
electener: -4336.04816537 hartree
oneelecener: -7471.16708290 hartree
twoeener: 3135.11891752 hartree
kineticenergy: 1850.65036007 hartree
xcener: -138.238015589228 hartree
chargesum: -0.0000000
charge: -0.038307 -0.035380 -0.291952 -0.307559 -0.103618 -0.149816 -0.146888 -0.099636 -0.128672 -0.121672 -0.124144 -0.095899 -0.153320 -0.263955 0.312591 0.145706 0.192183 0.062992 -0.150099 -0.111266 -0.167683 -0.187749 -0.146452 -0.103093 0.146794 0.057373 0.073853 0.056461 0.074431 0.073274 0.058414 0.068968 0.057269 0.078273 0.086975 0.053502 0.050196 0.115996 0.130690 0.085349 0.075454 0.075560 0.133985 0.120947 0.133548 0.128744 0.125404 0.152227
qa: -0.0383 -0.0354 -0.2920 -0.3076 -0.1036 -0.1498 -0.1469 -0.0996 -0.1287 -0.1217 -0.1241 -0.0959 -0.1533 -0.2640 0.3126 0.1457 0.1922 0.0630 -0.1501 -0.1113 -0.1677 -0.1877 -0.1465 -0.1031 0.1468 0.0574 0.0739 0.0565 0.0744 0.0733 0.0584 0.0690 0.0573 0.0783 0.0870 0.0535 0.0502 0.1160 0.1307 0.0853 0.0755 0.0756 0.1340 0.1209 0.1335 0.1287 0.1254 0.1522
va: 1.2614 2.3932 2.1010 2.1887 2.9645 2.9571 3.8816 3.8720 3.8432 3.8976 3.8482 3.8806 3.9247 3.9737 4.3097 3.8825 3.8810 3.5854 3.8902 4.0379 4.0756 3.9419 4.0069 3.8627 4.1889 1.0144 1.0155 1.0146 1.0124 1.0147 1.0257 1.0116 1.0106 1.0124 1.0163 1.0014 1.0034 1.0092 1.0222 1.0053 1.0037 1.0025 1.0153 1.0251 1.0172 1.0047 1.0046 0.9880
dispcorr: -0.026664501 hartree
energy: -1856.336813026975
dipole: 79.01777 -77.09129 1.92648 26.65633 -27.49418 -0.83785 6.45766 -6.15688 0.30078
magnitude: 2.12221 au
magnitude: 5.39424 debye
