program: Orca
programVersion: 5.0.2
elementType: Cl S O O N N C C C C C C C C C C C C C C C C C C C H H H H H H H H H H H H H H H H H H H H H H H
charge: 0
multiplicity: 1
keywords: wb97x-d3
keywords: def2-TZVPP
keywords: def2/J RIJCOSX
keywords: DEFGRID2
keywords: scfconv7
keywords: smallprint printgap noloewdin
keywords: NOSOSCF
formula: C19H23ClN2O2S
InChI: InChI=1/C19H23ClN2O2S/c1-2-3-4-5-6-10-13-25-19(23)24-16-14-17(20)21-22-18(16)15-11-8-7-9-12-15/h7-9,11-12,14H,2-6,10,13H2,1H3
48 atoms
Cl -6.071332 -1.854856 -1.393771
S  0.385589 -1.766009 2.364693
O  -1.787361 -1.231715 1.194184
O  -0.220021 -2.044259 -0.20355
N  -3.034174 0.428703 -1.77159
N  -4.17327 -0.189028 -1.957331
C  4.550826 0.020924 -0.398597
C  4.780903 1.290211 0.412465
C  4.011187 -1.155338 0.411966
C  5.316094 2.438588 -0.434671
C  2.628957 -0.882636 0.994751
C  5.4232 3.766828 0.30875
C  2.01933 -2.111666 1.647185
C  6.412737 3.752417 1.465361
C  -0.5535 -1.716071 0.889354
C  -2.590113 -0.88308 0.146213
C  -2.242406 0.140193 -0.750478
C  -0.999811 0.929373 -0.642888
C  -0.251739 1.178137 -1.791336
C  -0.574613 1.458995 0.573792
C  -3.783469 -1.528514 -0.024058
C  0.908281 1.930525 -1.720814
C  0.581269 2.222001 0.637812
C  1.32701 2.456292 -0.506501
C  -4.548977 -1.112728 -1.108381
H  5.490728 -0.274932 -0.874186
H  3.852643 0.235845 -1.214804
H  5.471665 1.072268 1.233068
H  3.843539 1.606958 0.880804
H  4.713708 -1.408271 1.213225
H  3.959359 -2.034561 -0.23731
H  4.660786 2.570973 -1.302152
H  6.29669 2.168628 -0.841502
H  2.677164 -0.079626 1.732795
H  1.971042 -0.527043 0.198506
H  5.713723 4.546364 -0.40017
H  4.43374 4.054703 0.680203
H  1.926009 -2.943576 0.948916
H  2.623807 -2.457583 2.487992
H  6.112745 3.059781 2.252043
H  6.501769 4.738586 1.920777
H  7.407509 3.455747 1.128215
H  -0.584098 0.776093 -2.738471
H  -1.155259 1.306108 1.473853
H  -4.103639 -2.322493 0.635672
H  1.484429 2.11284 -2.618296
H  0.894892 2.637582 1.586102
H  2.229485 3.051901 -0.454926
totalener: -1856.30853430 hartree
nucrepener: 2490.06910143 hartree
electener: -4346.37763573 hartree
oneelecener: -7491.78912336 hartree
twoeener: 3145.41148762 hartree
kineticenergy: 1850.65426764 hartree
xcener: -138.239695840337 hartree
chargesum: 0.0000000
charge: -0.038245 -0.031027 -0.289357 -0.303814 -0.101418 -0.150508 -0.110805 -0.127138 -0.141312 -0.155898 -0.107229 -0.100444 -0.135979 -0.252335 0.303081 0.144488 0.194553 0.043594 -0.084166 -0.138370 -0.172166 -0.170933 -0.168455 -0.094401 0.147341 0.078832 0.061375 0.077727 0.041085 0.064302 0.077365 0.069181 0.075207 0.069877 0.066221 0.071601 0.047388 0.116612 0.115856 0.073792 0.087231 0.077381 0.118769 0.132680 0.133899 0.125575 0.122985 0.136004
qa: -0.0382 -0.0310 -0.2894 -0.3038 -0.1014 -0.1505 -0.1108 -0.1271 -0.1413 -0.1559 -0.1072 -0.1004 -0.1360 -0.2523 0.3031 0.1445 0.1946 0.0436 -0.0842 -0.1384 -0.1722 -0.1709 -0.1685 -0.0944 0.1473 0.0788 0.0614 0.0777 0.0411 0.0643 0.0774 0.0692 0.0752 0.0699 0.0662 0.0716 0.0474 0.1166 0.1159 0.0738 0.0872 0.0774 0.1188 0.1327 0.1339 0.1256 0.1230 0.1360
va: 1.2613 2.4012 2.1054 2.1904 2.9652 2.9556 3.8851 3.8371 3.9334 3.9014 3.8405 3.8880 3.9449 3.9327 4.3198 3.8930 3.8704 3.5862 4.0081 3.8736 4.0730 3.9715 3.9361 3.8562 4.1882 1.0138 1.0172 1.0108 1.0131 1.0111 1.0120 1.0088 1.0139 1.0143 1.0204 1.0093 1.0121 1.0260 1.0100 1.0014 1.0070 1.0030 1.0246 1.0153 1.0173 1.0057 1.0066 0.9886
dispcorr: -0.027432783 hartree
energy: -1856.335967085035
dipole: 79.21544 -77.63065 1.58479 26.24174 -26.47398 -0.23224 9.05998 -7.75922 1.30076
magnitude: 2.06337 au
magnitude: 5.24466 debye
