program: Orca
programVersion: 5.0.2
elementType: Cl S O O N N C C C C C C C C C C C C C C C C C C C H H H H H H H H H H H H H H H H H H H H H H H
charge: 0
multiplicity: 1
keywords: wb97x-d3
keywords: def2-TZVPP
keywords: def2/J RIJCOSX
keywords: DEFGRID2
keywords: scfconv7
keywords: smallprint printgap noloewdin
keywords: NOSOSCF
formula: C19H23ClN2O2S
InChI: InChI=1/C19H23ClN2O2S/c1-2-3-4-5-6-10-13-25-19(23)24-16-14-17(20)21-22-18(16)15-11-8-7-9-12-15/h7-9,11-12,14H,2-6,10,13H2,1H3
48 atoms
Cl -5.850294 -0.057137 1.032338
S  0.96364 -2.990988 0.302148
O  -1.281173 -1.906242 -0.03469
O  0.066707 -0.703436 1.312144
N  -2.813052 1.26816 -0.86146
N  -3.985333 1.147948 -0.293441
C  5.203219 0.25816 0.559391
C  4.411542 1.533471 0.275239
C  4.411862 -0.856244 1.240441
C  3.746333 2.142828 1.503469
C  3.188699 -1.309629 0.452004
C  3.081675 3.483712 1.219828
C  2.433728 -2.40279 1.189552
C  2.39307 4.072715 2.44207
C  -0.121604 -1.660508 0.631551
C  -2.185822 -0.886514 -0.116484
C  -1.912418 0.298052 -0.818638
C  -0.636528 0.559571 -1.510696
C  -0.010041 -0.41406 -2.286044
C  -0.058776 1.823656 -1.409547
C  -3.410317 -1.034132 0.474563
C  1.183698 -0.132227 -2.931838
C  1.133404 2.100474 -2.055545
C  1.761845 1.121662 -2.812984
C  -4.285003 0.037813 0.333636
H  6.062894 0.504814 1.189726
H  5.619181 -0.120327 -0.379518
H  3.650404 1.342971 -0.487618
H  5.092245 2.268471 -0.165833
H  4.099385 -0.531342 2.237587
H  5.076544 -1.71086 1.401273
H  4.489019 2.265983 2.300377
H  2.990268 1.456256 1.898079
H  2.519068 -0.466373 0.276581
H  3.491983 -1.674491 -0.533217
H  3.828729 4.188667 0.842466
H  2.350328 3.356938 0.416286
H  3.05153 -3.294248 1.315612
H  2.128767 -2.078116 2.184902
H  1.615471 3.405174 2.81605
H  1.923929 5.030607 2.216634
H  3.102489 4.237697 3.254631
H  -0.458673 -1.389753 -2.415336
H  -0.550263 2.585997 -0.820698
H  -3.674797 -1.923951 1.028233
H  1.656906 -0.895663 -3.534541
H  1.575429 3.084137 -1.967792
H  2.695097 1.340079 -3.315111
totalener: -1856.30975475 hartree
nucrepener: 2533.08545523 hartree
electener: -4389.39520998 hartree
oneelecener: -7578.01326788 hartree
twoeener: 3188.61805790 hartree
kineticenergy: 1850.65352585 hartree
xcener: -138.239998809894 hartree
chargesum: 0.0000000
charge: -0.037925 -0.028698 -0.290467 -0.310432 -0.101308 -0.151985 -0.148590 -0.084667 -0.150430 -0.120814 -0.111870 -0.071517 -0.123758 -0.257737 0.303788 0.142944 0.194734 0.052259 -0.145038 -0.086179 -0.168000 -0.165539 -0.194713 -0.083454 0.146732 0.075311 0.070896 0.023087 0.072458 0.074313 0.079276 0.062627 0.058948 0.057802 0.074716 0.055329 0.033610 0.116323 0.114282 0.078350 0.084176 0.072337 0.136515 0.122566 0.133978 0.124189 0.139023 0.132550
qa: -0.0379 -0.0287 -0.2905 -0.3104 -0.1013 -0.1520 -0.1486 -0.0847 -0.1504 -0.1208 -0.1119 -0.0715 -0.1238 -0.2577 0.3038 0.1429 0.1947 0.0523 -0.1450 -0.0862 -0.1680 -0.1655 -0.1947 -0.0835 0.1467 0.0753 0.0709 0.0231 0.0725 0.0743 0.0793 0.0626 0.0589 0.0578 0.0747 0.0553 0.0336 0.1163 0.1143 0.0783 0.0842 0.0723 0.1365 0.1226 0.1340 0.1242 0.1390 0.1325
va: 1.2620 2.4103 2.1023 2.1776 2.9639 2.9571 3.9212 3.8621 3.9147 3.8625 3.8436 3.8966 3.9165 3.9584 4.3161 3.8921 3.8827 3.5938 3.8865 3.9731 4.0743 3.9610 3.9393 3.8661 4.1893 1.0092 1.0103 1.0283 1.0140 1.0026 1.0106 1.0113 1.0074 1.0167 1.0201 1.0096 1.0205 1.0120 1.0245 1.0036 1.0062 1.0038 1.0136 1.0257 1.0171 1.0049 0.9945 0.9980
dispcorr: -0.027225195 hartree
energy: -1856.336979948436
dipole: 65.40526 -63.75135 1.65391 18.74125 -19.96525 -1.22400 6.87034 -6.80644 0.06391
magnitude: 2.05856 au
magnitude: 5.23245 debye
