program: Orca
programVersion: 5.0.2
elementType: Cl S O O N N C C C C C C C C C C C C C C C C C C C H H H H H H H H H H H H H H H H H H H H H H H
charge: 0
multiplicity: 1
keywords: wb97x-d3
keywords: def2-TZVPP
keywords: def2/J RIJCOSX
keywords: DEFGRID2
keywords: scfconv7
keywords: smallprint printgap noloewdin
keywords: NOSOSCF
formula: C19H23ClN2O2S
InChI: InChI=1/C19H23ClN2O2S/c1-2-3-4-5-6-10-13-25-19(23)24-16-14-17(20)21-22-18(16)15-11-8-7-9-12-15/h7-9,11-12,14H,2-6,10,13H2,1H3
48 atoms
Cl -6.340874 -1.56101 -0.540171
S  0.987954 -2.744266 0.225937
O  -1.312703 -2.030103 -0.513692
O  -0.875692 -1.470229 1.62414
N  -3.426186 0.90434 -0.567104
N  -4.620757 0.370028 -0.543336
C  3.900714 0.793851 1.273038
C  4.856437 1.31216 0.207856
C  3.398351 -0.61621 0.995568
C  5.315403 2.742165 0.459046
C  2.367529 -1.072498 2.017048
C  6.266811 3.271101 -0.606105
C  1.855517 -2.488119 1.803778
C  6.720537 4.698786 -0.33899
C  -0.532159 -1.966686 0.599128
C  -2.425981 -1.238725 -0.528089
C  -2.331043 0.160486 -0.580564
C  -1.046331 0.883968 -0.62776
C  -0.01147 0.478385 -1.468174
C  -0.880345 2.025395 0.153843
C  -3.665768 -1.814903 -0.515414
C  1.17017 1.201335 -1.519837
C  0.304951 2.739123 0.106405
C  1.332501 2.330276 -0.732176
C  -4.742489 -0.933928 -0.539081
H  3.041406 1.468038 1.346955
H  4.393002 0.824328 2.25109
H  4.370084 1.253566 -0.772709
H  5.729922 0.654188 0.145859
H  4.243629 -1.313449 0.982102
H  2.956133 -0.648051 -0.004484
H  5.799197 2.801847 1.439997
H  4.440026 3.399236 0.521046
H  2.80577 -1.038937 3.020094
H  1.526691 -0.376178 2.032503
H  7.139978 2.614741 -0.669012
H  5.780942 3.217812 -1.58525
H  2.681535 -3.201706 1.77095
H  1.191068 -2.798531 2.609546
H  5.87227 5.384347 -0.303965
H  7.399525 5.055998 -1.113338
H  7.241877 4.775725 0.616559
H  -0.129479 -0.383482 -2.110898
H  -1.686453 2.348413 0.798224
H  -3.79946 -2.886657 -0.473698
H  1.961777 0.88396 -2.185708
H  0.424892 3.621393 0.72091
H  2.256361 2.893002 -0.774597
totalener: -1856.31090209 hartree
nucrepener: 2473.98842759 hartree
electener: -4330.29932968 hartree
oneelecener: -7459.66880066 hartree
twoeener: 3129.36947099 hartree
kineticenergy: 1850.65428766 hartree
xcener: -138.238280567751 hartree
chargesum: -0.0000000
charge: -0.038090 -0.032936 -0.293311 -0.309259 -0.103701 -0.149631 -0.120356 -0.139054 -0.125357 -0.115209 -0.130987 -0.075615 -0.153846 -0.257255 0.311445 0.141491 0.194144 0.079892 -0.168260 -0.117070 -0.163741 -0.181477 -0.144792 -0.103280 0.145777 0.060153 0.079369 0.050251 0.071015 0.074496 0.056996 0.065996 0.046150 0.078724 0.089634 0.054726 0.051116 0.115302 0.131115 0.072383 0.085486 0.072844 0.133946 0.121274 0.133529 0.133471 0.127258 0.145240
qa: -0.0381 -0.0329 -0.2933 -0.3093 -0.1037 -0.1496 -0.1204 -0.1391 -0.1254 -0.1152 -0.1310 -0.0756 -0.1538 -0.2573 0.3114 0.1415 0.1941 0.0799 -0.1683 -0.1171 -0.1637 -0.1815 -0.1448 -0.1033 0.1458 0.0602 0.0794 0.0503 0.0710 0.0745 0.0570 0.0660 0.0461 0.0787 0.0896 0.0547 0.0511 0.1153 0.1311 0.0724 0.0855 0.0728 0.1339 0.1213 0.1335 0.1335 0.1273 0.1452
va: 1.2618 2.3961 2.0987 2.1867 2.9666 2.9569 3.8628 3.8815 3.8366 3.8698 3.8460 3.8819 3.9295 3.9566 4.3141 3.8849 3.8757 3.5656 3.9084 4.0308 4.0782 3.9264 3.9672 3.8660 4.1899 1.0154 1.0131 1.0110 1.0160 1.0144 1.0278 1.0127 1.0119 1.0121 1.0179 1.0082 1.0076 1.0093 1.0200 1.0029 1.0063 1.0032 1.0153 1.0255 1.0168 1.0021 1.0041 0.9833
dispcorr: -0.026501466 hartree
energy: -1856.337403553080
dipole: 79.48355 -77.57495 1.90860 29.04742 -29.90862 -0.86120 8.45082 -8.27219 0.17863
magnitude: 2.10151 au
magnitude: 5.34161 debye
