program: Orca
programVersion: 5.0.2
elementType: Cl S O O N N C C C C C C C C C C C C C C C C C C C H H H H H H H H H H H H H H H H H H H H H H H
charge: 0
multiplicity: 1
keywords: wb97x-d3
keywords: def2-TZVPP
keywords: def2/J RIJCOSX
keywords: DEFGRID2
keywords: scfconv7
keywords: smallprint printgap noloewdin
keywords: NOSOSCF
formula: C19H23ClN2O2S
InChI: InChI=1/C19H23ClN2O2S/c1-2-3-4-5-6-10-13-25-19(23)24-16-14-17(20)21-22-18(16)15-11-8-7-9-12-15/h7-9,11-12,14H,2-6,10,13H2,1H3
48 atoms
Cl -5.365439 -1.049824 -1.593532
S  0.975654 -2.503365 1.876996
O  -1.161429 -1.409491 1.164731
O  0.389256 -1.382612 -0.468236
N  -2.666903 1.424784 -0.515013
N  -3.716318 0.873407 -1.065106
C  3.758134 -0.256671 -0.470399
C  3.683082 1.210446 -0.87179
C  3.546401 -0.455308 1.026189
C  3.968488 1.473013 -2.347922
C  3.673144 -1.902584 1.485455
C  3.004277 0.805284 -3.326417
C  2.553367 -2.829748 1.031442
C  1.548906 1.20483 -3.122845
C  0.064218 -1.671198 0.638898
C  -2.013542 -0.643676 0.418715
C  -1.816071 0.732701 0.230564
C  -0.688271 1.495918 0.797365
C  -0.141126 2.538785 0.050255
C  -0.187719 1.245474 2.074564
C  -3.113759 -1.235421 -0.138395
C  0.896497 3.298634 0.560639
C  0.850149 2.011692 2.582399
C  1.398374 3.03624 1.82754
C  -3.949049 -0.401261 -0.872075
H  4.735166 -0.663789 -0.756384
H  3.011935 -0.825154 -1.030307
H  4.399355 1.780908 -0.271179
H  2.698349 1.602183 -0.604687
H  2.573038 -0.050072 1.320894
H  4.286234 0.139893 1.569643
H  4.989376 1.151453 -2.578222
H  3.949301 2.55399 -2.520516
H  4.61347 -2.31996 1.11018
H  3.742787 -1.942312 2.57542
H  3.31153 1.063425 -4.343382
H  3.094669 -0.282336 -3.2596
H  2.38221 -2.784345 -0.043681
H  2.792813 -3.86513 1.275636
H  1.156751 0.846954 -2.170561
H  0.913585 0.792142 -3.906648
H  1.431786 2.290633 -3.143285
H  -0.534401 2.748529 -0.934792
H  -0.620128 0.476483 2.699405
H  -3.312645 -2.291569 -0.022613
H  1.317046 4.097392 -0.035677
H  1.224791 1.807556 3.576482
H  2.212094 3.628831 2.223848
totalener: -1856.30777712 hartree
nucrepener: 2586.00486800 hartree
electener: -4442.31264512 hartree
oneelecener: -7684.06481097 hartree
twoeener: 3241.75216585 hartree
kineticenergy: 1850.64776788 hartree
xcener: -138.241643796169 hartree
chargesum: -0.0000000
charge: -0.037375 -0.031159 -0.293440 -0.324506 -0.101816 -0.154674 -0.154581 -0.050588 -0.060308 -0.141270 -0.133872 -0.120851 -0.155659 -0.227763 0.319438 0.158905 0.183815 0.104412 -0.161566 -0.185911 -0.159093 -0.136187 -0.144460 -0.089870 0.148014 0.064843 0.065628 0.070942 0.001891 0.013635 0.076466 0.065738 0.070187 0.072494 0.084597 0.067493 0.060283 0.114921 0.126145 0.055055 0.089121 0.071670 0.129845 0.133928 0.132497 0.129846 0.125597 0.127544
qa: -0.0374 -0.0312 -0.2934 -0.3245 -0.1018 -0.1547 -0.1546 -0.0506 -0.0603 -0.1413 -0.1339 -0.1209 -0.1557 -0.2278 0.3194 0.1589 0.1838 0.1044 -0.1616 -0.1859 -0.1591 -0.1362 -0.1445 -0.0899 0.1480 0.0648 0.0656 0.0709 0.0019 0.0136 0.0765 0.0657 0.0702 0.0725 0.0846 0.0675 0.0603 0.1149 0.1261 0.0551 0.0891 0.0717 0.1298 0.1339 0.1325 0.1298 0.1256 0.1275
va: 1.2626 2.4031 2.0973 2.1611 2.9571 2.9621 3.8801 3.8707 3.8845 3.9167 3.9068 3.9015 3.9028 3.9329 4.2936 3.8734 3.8766 3.5662 3.9651 3.9135 4.0802 3.9040 3.9212 3.9059 4.1863 1.0142 1.0067 1.0129 1.0360 1.0300 1.0136 1.0113 1.0095 1.0122 1.0142 1.0090 1.0021 1.0253 1.0081 1.0020 1.0113 1.0029 1.0236 1.0163 1.0172 1.0037 1.0047 0.9986
dispcorr: -0.029559573 hartree
energy: -1856.337336696380
dipole: 58.20335 -56.72061 1.48274 11.00312 -11.98929 -0.98616 -6.73129 7.74828 1.01699
magnitude: 2.05068 au
magnitude: 5.21242 debye
