program: Orca
programVersion: 5.0.2
elementType: Cl S O O N N C C C C C C C C C C C C C C C C C C C H H H H H H H H H H H H H H H H H H H H H H H
charge: 0
multiplicity: 1
keywords: wb97x-d3
keywords: def2-TZVPP
keywords: def2/J RIJCOSX
keywords: DEFGRID2
keywords: scfconv7
keywords: smallprint printgap noloewdin
keywords: NOSOSCF
formula: C19H23ClN2O2S
InChI: InChI=1/C19H23ClN2O2S/c1-2-3-4-5-6-10-13-25-19(23)24-16-14-17(20)21-22-18(16)15-11-8-7-9-12-15/h7-9,11-12,14H,2-6,10,13H2,1H3
48 atoms
Cl -6.338293 -1.69924 -0.709058
S  0.969623 -2.675416 0.362253
O  -1.305336 -1.993214 -0.474414
O  -0.931682 -1.343277 1.650482
N  -3.512889 0.867776 -0.646402
N  -4.688139 0.291957 -0.668764
C  3.983246 0.827925 1.251773
C  4.972467 1.238194 0.169914
C  3.404271 -0.563628 1.038218
C  5.546016 2.633479 0.377231
C  2.337625 -0.913012 2.065828
C  6.546739 3.043971 -0.695071
C  1.796561 -2.328199 1.9440
C  7.120971 4.434972 -0.468983
C  -0.559072 -1.881685 0.657405
C  -2.441161 -1.238112 -0.541599
C  -2.392985 0.162988 -0.602872
C  -1.133568 0.931068 -0.590422
C  -0.046781 0.566515 -1.382579
C  -1.042286 2.068537 0.208618
C  -3.659708 -1.857342 -0.574676
C  1.112509 1.326753 -1.370018
C  0.120791 2.819224 0.226113
C  1.200696 2.451744 -0.564657
C  -4.764381 -1.015374 -0.652773
H  3.163969 1.553054 1.288968
H  4.472486 0.875544 2.230611
H  4.479737 1.188993 -0.807961
H  5.790934 0.51138 0.127577
H  4.210245 -1.305325 1.072424
H  2.973451 -0.624441 0.034517
H  6.026253 2.686206 1.360346
H  4.727942 3.362398 0.407449
H  2.754026 -0.815113 3.073948
H  1.514919 -0.197029 2.007364
H  7.360705 2.313443 -0.727826
H  6.065548 3.000429 -1.67686
H  2.605388 -3.06041 1.989445
H  1.10061 -2.563034 2.7486
H  6.335929 5.192829 -0.466705
H  7.83599 4.705344 -1.246092
H  7.638079 4.497997 0.489881
H  -0.106039 -0.292647 -2.037231
H  -1.88783 2.358383 0.817262
H  -3.757896 -2.932711 -0.527039
H  1.945374 1.041739 -1.999212
H  0.182255 3.697574 0.854654
H  2.107076 3.043576 -0.557937
totalener: -1856.31122079 hartree
nucrepener: 2464.17481632 hartree
electener: -4320.48603711 hartree
oneelecener: -7440.03864017 hartree
twoeener: 3119.55260306 hartree
kineticenergy: 1850.65512131 hartree
xcener: -138.237769140120 hartree
chargesum: 0.0000000
charge: -0.038164 -0.033773 -0.292486 -0.308731 -0.103494 -0.148899 -0.137864 -0.122538 -0.119770 -0.104317 -0.127689 -0.077383 -0.154643 -0.256970 0.312630 0.143637 0.194283 0.072673 -0.166409 -0.115537 -0.165820 -0.174793 -0.137918 -0.112946 0.145957 0.060819 0.076828 0.051190 0.066167 0.074459 0.057323 0.059687 0.045274 0.078384 0.087090 0.053012 0.051599 0.116045 0.131029 0.072147 0.085601 0.072594 0.133286 0.120750 0.133594 0.134200 0.126295 0.143591
qa: -0.0382 -0.0338 -0.2925 -0.3087 -0.1035 -0.1489 -0.1379 -0.1225 -0.1198 -0.1043 -0.1277 -0.0774 -0.1546 -0.2570 0.3126 0.1436 0.1943 0.0727 -0.1664 -0.1155 -0.1658 -0.1748 -0.1379 -0.1129 0.1460 0.0608 0.0768 0.0512 0.0662 0.0745 0.0573 0.0597 0.0453 0.0784 0.0871 0.0530 0.0516 0.1160 0.1310 0.0721 0.0856 0.0726 0.1333 0.1207 0.1336 0.1342 0.1263 0.1436
va: 1.2617 2.3947 2.1008 2.1871 2.9659 2.9562 3.8793 3.8782 3.8315 3.8778 3.8492 3.8885 3.9271 3.9557 4.3111 3.8835 3.8773 3.5727 3.9088 4.0359 4.0769 3.9224 3.9764 3.8762 4.1898 1.0148 1.0141 1.0122 1.0152 1.0140 1.0275 1.0123 1.0126 1.0122 1.0172 1.0083 1.0075 1.0092 1.0215 1.0031 1.0063 1.0032 1.0158 1.0251 1.0170 1.0016 1.0035 0.9885
dispcorr: -0.026110530 hartree
energy: -1856.337331319083
dipole: 81.18173 -79.25461 1.92712 28.91732 -29.72635 -0.80903 8.81290 -8.54756 0.26535
magnitude: 2.10683 au
magnitude: 5.35514 debye
