program: Orca
programVersion: 5.0.2
elementType: Cl S O O N N C C C C C C C C C C C C C C C C C C C H H H H H H H H H H H H H H H H H H H H H H H
charge: 0
multiplicity: 1
keywords: wb97x-d3
keywords: def2-TZVPP
keywords: def2/J RIJCOSX
keywords: DEFGRID2
keywords: scfconv7
keywords: smallprint printgap noloewdin
keywords: NOSOSCF
formula: C19H23ClN2O2S
InChI: InChI=1/C19H23ClN2O2S/c1-2-3-4-5-6-10-13-25-19(23)24-16-14-17(20)21-22-18(16)15-11-8-7-9-12-15/h7-9,11-12,14H,2-6,10,13H2,1H3
48 atoms
Cl -6.092302 -0.895149 1.109247
S  0.37432 2.167249 -1.006211
O  -1.862571 1.039058 -0.833366
O  -0.204245 -0.187942 0.079482
N  -3.495183 -2.143803 -1.395887
N  -4.525007 -2.05189 -0.593608
C  4.189473 1.531901 2.699037
C  5.621092 1.089626 2.974136
C  3.793204 1.358059 1.238635
C  6.043207 1.255694 4.428017
C  2.362255 1.793898 0.943203
C  7.474897 0.804002 4.68993
C  2.031118 1.605577 -0.527228
C  7.896514 0.97056 6.142706
C  -0.571483 0.794141 -0.481578
C  -2.750372 0.006002 -0.750842
C  -2.618054 -1.159808 -1.522046
C  -1.513217 -1.382124 -2.473179
C  -0.882238 -2.623457 -2.499696
C  -1.099604 -0.389317 -3.358516
C  -3.827017 0.123809 0.084384
C  0.161616 -2.858198 -3.377403
C  -0.056851 -0.630043 -4.239775
C  0.580091 -1.861142 -4.247213
C  -4.70138 -0.957293 0.103463
H  4.068986 2.581271 2.988344
H  3.50209 0.962723 3.333401
H  6.304243 1.656784 2.332389
H  5.737069 0.040602 2.681044
H  3.917264 0.308205 0.953298
H  4.485384 1.926523 0.607654
H  5.360705 0.69132 5.072688
H  5.934206 2.305283 4.722344
H  1.666844 1.214816 1.553878
H  2.226841 2.84332 1.217929
H  7.582487 -0.244245 4.395009
H  8.15529 1.367882 4.044574
H  2.703441 2.196924 -1.152708
H  2.138333 0.564924 -0.835092
H  7.25533 0.392409 6.809986
H  7.836957 2.01441 6.455396
H  8.922368 0.638027 6.303073
H  -1.209839 -3.399361 -1.821599
H  -1.600903 0.569154 -3.385106
H  -3.979738 0.998588 0.70061
H  0.651153 -3.822939 -3.382376
H  0.252001 0.146936 -4.926144
H  1.396646 -2.045709 -4.932735
totalener: -1856.31107601 hartree
nucrepener: 2338.62620782 hartree
electener: -4194.93728383 hartree
oneelecener: -7189.09835560 hartree
twoeener: 2994.16107177 hartree
kineticenergy: 1850.65066869 hartree
xcener: -138.234034247047 hartree
chargesum: -0.0000000
charge: -0.039074 -0.032252 -0.289769 -0.311076 -0.101560 -0.149294 -0.107012 -0.100739 -0.117100 -0.106541 -0.137789 -0.078455 -0.116156 -0.258038 0.304757 0.154535 0.188100 0.064364 -0.124595 -0.167858 -0.173976 -0.141846 -0.147896 -0.097821 0.147045 0.055620 0.060513 0.052520 0.055146 0.067240 0.056022 0.053453 0.052196 0.086620 0.067145 0.052531 0.051432 0.113549 0.115755 0.072633 0.072082 0.084973 0.119892 0.136965 0.133903 0.126588 0.125259 0.128008
qa: -0.0391 -0.0323 -0.2898 -0.3111 -0.1016 -0.1493 -0.1070 -0.1007 -0.1171 -0.1065 -0.1378 -0.0785 -0.1162 -0.2580 0.3048 0.1545 0.1881 0.0644 -0.1246 -0.1679 -0.1740 -0.1418 -0.1479 -0.0978 0.1470 0.0556 0.0605 0.0525 0.0551 0.0672 0.0560 0.0535 0.0522 0.0866 0.0671 0.0525 0.0514 0.1135 0.1158 0.0726 0.0721 0.0850 0.1199 0.1370 0.1339 0.1266 0.1253 0.1280
va: 1.2605 2.4110 2.1010 2.1808 2.9621 2.9564 3.8956 3.8882 3.8967 3.8938 3.8736 3.8894 3.9118 3.9555 4.3225 3.8762 3.8892 3.5928 4.0411 3.9125 4.0753 3.9785 3.9754 3.9381 4.1884 1.0124 1.0131 1.0117 1.0122 1.0109 1.0108 1.0110 1.0107 1.0229 1.0195 1.0078 1.0077 1.0118 1.0213 1.0032 1.0031 1.0061 1.0259 1.0135 1.0177 1.0021 1.0040 0.9985
dispcorr: -0.021552141 hartree
energy: -1856.332628152323
dipole: 86.22590 -84.48453 1.74137 14.16180 -12.80097 1.36083 30.21886 -30.27374 -0.05488
magnitude: 2.21071 au
magnitude: 5.61918 debye
