program: Orca
programVersion: 5.0.2
elementType: Cl S O O N N C C C C C C C C C C C C C C C C C C C H H H H H H H H H H H H H H H H H H H H H H H
charge: 0
multiplicity: 1
keywords: wb97x-d3
keywords: def2-TZVPP
keywords: def2/J RIJCOSX
keywords: DEFGRID2
keywords: scfconv7
keywords: smallprint printgap noloewdin
keywords: NOSOSCF
formula: C19H23ClN2O2S
InChI: InChI=1/C19H23ClN2O2S/c1-2-3-4-5-6-10-13-25-19(23)24-16-14-17(20)21-22-18(16)15-11-8-7-9-12-15/h7-9,11-12,14H,2-6,10,13H2,1H3
48 atoms
Cl -5.872332 -1.565568 -1.753428
S  0.280996 -1.567292 2.470131
O  -1.770624 -0.96937 1.122961
O  -0.17235 -1.961099 -0.113827
N  -2.697634 0.539186 -2.032552
N  -3.852957 -0.031915 -2.26602
C  4.725142 -0.181732 -0.080986
C  5.058505 1.054831 0.744564
C  4.037998 -1.295055 0.705843
C  5.764087 2.13383 -0.06798
C  2.652872 -0.899525 1.204256
C  6.200258 3.348562 0.746556
C  1.930636 -2.051642 1.881915
C  5.049257 4.120861 1.378371
C  -0.554793 -1.547952 0.934011
C  -2.477557 -0.654634 -0.001975
C  -2.004582 0.280986 -0.93556
C  -0.723858 0.997893 -0.778121
C  0.164461 1.050851 -1.849066
C  -0.394887 1.640158 0.413212
C  -3.688591 -1.249336 -0.221878
C  1.367849 1.724437 -1.725123
C  0.804725 2.325984 0.528562
C  1.690556 2.364994 -0.536699
C  -4.342064 -0.875024 -1.391641
H  5.646468 -0.574818 -0.521256
H  4.085691 0.106415 -0.922459
H  5.692197 0.765909 1.591301
H  4.142523 1.464584 1.178369
H  4.669576 -1.594251 1.549481
H  3.9477 -2.177236 0.065085
H  5.108024 2.460813 -0.883289
H  6.64328 1.697841 -0.552487
H  2.720067 -0.066069 1.906348
H  2.060541 -0.541661 0.359369
H  6.896245 3.02792 1.527786
H  6.767739 4.021669 0.098947
H  1.828089 -2.915821 1.225381
H  2.460278 -2.382138 2.777592
H  4.328759 4.443258 0.623217
H  5.407018 5.015959 1.88745
H  4.510892 3.524831 2.115944
H  -0.091274 0.555917 -2.7760
H  -1.082411 1.630973 1.248904
H  -4.102239 -1.978038 0.460864
H  2.054756 1.753486 -2.560689
H  1.044832 2.832606 1.453808
H  2.629226 2.895751 -0.442614
totalener: -1856.30855484 hartree
nucrepener: 2500.15782028 hartree
electener: -4356.46637511 hartree
oneelecener: -7511.98046790 hartree
twoeener: 3155.51409279 hartree
kineticenergy: 1850.65672774 hartree
xcener: -138.239973027110 hartree
chargesum: 0.0000000
charge: -0.038628 -0.029625 -0.287945 -0.306147 -0.099775 -0.148551 -0.111084 -0.120359 -0.142442 -0.141947 -0.101558 -0.087338 -0.137763 -0.278067 0.305747 0.141618 0.186618 0.038245 -0.076848 -0.126268 -0.171849 -0.180996 -0.168550 -0.078155 0.147047 0.078104 0.060864 0.072693 0.035280 0.063454 0.079288 0.061506 0.073018 0.071142 0.059708 0.053166 0.069931 0.116582 0.115904 0.076054 0.096607 0.078283 0.118595 0.128545 0.134364 0.125965 0.123148 0.122414
qa: -0.0386 -0.0296 -0.2879 -0.3061 -0.0998 -0.1486 -0.1111 -0.1204 -0.1424 -0.1419 -0.1016 -0.0873 -0.1378 -0.2781 0.3057 0.1416 0.1866 0.0382 -0.0768 -0.1263 -0.1718 -0.1810 -0.1685 -0.0782 0.1470 0.0781 0.0609 0.0727 0.0353 0.0635 0.0793 0.0615 0.0730 0.0711 0.0597 0.0532 0.0699 0.1166 0.1159 0.0761 0.0966 0.0783 0.1186 0.1285 0.1344 0.1260 0.1231 0.1224
va: 1.2611 2.4029 2.1092 2.1882 2.9666 2.9531 3.8829 3.8476 3.9371 3.8992 3.8430 3.8789 3.9468 3.9347 4.3156 3.8895 3.8712 3.6013 3.9924 3.8794 4.0762 3.9691 3.9504 3.8359 4.1893 1.0155 1.0169 1.0141 1.0093 1.0108 1.0116 1.0078 1.0159 1.0142 1.0220 1.0099 1.0093 1.0261 1.0103 1.0011 1.0086 0.9983 1.0230 1.0154 1.0171 1.0059 1.0054 0.9945
dispcorr: -0.027932787 hartree
energy: -1856.336487622232
dipole: 77.22174 -75.71508 1.50666 23.19088 -23.43550 -0.24463 13.20027 -11.74055 1.45972
magnitude: 2.11203 au
magnitude: 5.36835 debye
