program: Orca
programVersion: 5.0.2
elementType: Cl S O O N N C C C C C C C C C C C C C C C C C C C H H H H H H H H H H H H H H H H H H H H H H H
charge: 0
multiplicity: 1
keywords: wb97x-d3
keywords: def2-TZVPP
keywords: def2/J RIJCOSX
keywords: DEFGRID2
keywords: scfconv7
keywords: smallprint printgap noloewdin
keywords: NOSOSCF
formula: C19H23ClN2O2S
InChI: InChI=1/C19H23ClN2O2S/c1-2-3-4-5-6-10-13-25-19(23)24-16-14-17(20)21-22-18(16)15-11-8-7-9-12-15/h7-9,11-12,14H,2-6,10,13H2,1H3
48 atoms
Cl -6.360537 -1.916288 -0.714453
S  0.734549 -1.721328 1.547825
O  -1.419883 -1.646088 0.246065
O  -1.290192 -0.020865 1.800814
N  -3.629686 0.636885 -1.489772
N  -4.776862 0.015384 -1.388862
C  3.921078 1.684983 0.853127
C  5.12579 1.455752 -0.054336
C  3.257102 0.405955 1.34717
C  6.303836 0.770862 0.628646
C  2.016556 0.682092 2.184132
C  7.532575 0.661586 -0.265227
C  1.395335 -0.567211 2.786842
C  8.707822 -0.015161 0.424905
C  -0.810491 -0.958364 1.24864
C  -2.542376 -1.092263 -0.298455
C  -2.512988 0.1280 -0.99216
C  -1.288287 0.926292 -1.189176
C  -0.079445 0.339373 -1.558587
C  -1.352756 2.30922 -1.033451
C  -3.730278 -1.761161 -0.192776
C  1.04575 1.124231 -1.75922
C  -0.226159 3.088622 -1.229765
C  0.976605 2.498757 -1.592579
C  -4.827574 -1.145911 -0.785539
H  3.176157 2.279713 0.316377
H  4.227849 2.29154 1.712241
H  5.45921 2.42144 -0.447127
H  4.819011 0.867929 -0.927055
H  3.966608 -0.179621 1.940757
H  2.988078 -0.216922 0.48781
H  6.0169 -0.231696 0.960996
H  6.565749 1.325051 1.537251
H  2.279406 1.345092 3.015203
H  1.27124 1.218841 1.592025
H  7.272597 0.108611 -1.173075
H  7.829004 1.661193 -0.597365
H  2.13945 -1.14791 3.335735
H  0.59399 -0.324959 3.483727
H  9.574834 -0.082392 -0.232727
H  8.453501 -1.029191 0.73847
H  9.013472 0.535314 1.316269
H  -0.011786 -0.7278 -1.722568
H  -2.291451 2.768644 -0.755868
H  -3.811374 -2.703519 0.330562
H  1.977074 0.659263 -2.054791
H  -0.287946 4.161023 -1.101331
H  1.855283 3.10967 -1.753342
totalener: -1856.31010543 hartree
nucrepener: 2448.63938025 hartree
electener: -4304.94948568 hartree
oneelecener: -7408.96092132 hartree
twoeener: 3104.01143564 hartree
kineticenergy: 1850.65396646 hartree
xcener: -138.238190824723 hartree
chargesum: 0.0000000
charge: -0.038254 -0.035170 -0.291395 -0.306135 -0.103054 -0.150452 -0.148188 -0.117747 -0.128380 -0.104476 -0.132183 -0.085906 -0.146832 -0.253456 0.310114 0.146926 0.196203 0.070768 -0.166169 -0.125138 -0.168748 -0.163557 -0.127273 -0.117481 0.146684 0.072093 0.072861 0.068650 0.055240 0.073784 0.061710 0.053225 0.055287 0.078896 0.085048 0.053285 0.052546 0.114338 0.131216 0.085554 0.071214 0.072406 0.136566 0.120830 0.133708 0.127275 0.127219 0.136346
qa: -0.0383 -0.0352 -0.2914 -0.3061 -0.1031 -0.1505 -0.1482 -0.1177 -0.1284 -0.1045 -0.1322 -0.0859 -0.1468 -0.2535 0.3101 0.1469 0.1962 0.0708 -0.1662 -0.1251 -0.1687 -0.1636 -0.1273 -0.1175 0.1467 0.0721 0.0729 0.0686 0.0552 0.0738 0.0617 0.0532 0.0553 0.0789 0.0850 0.0533 0.0525 0.1143 0.1312 0.0856 0.0712 0.0724 0.1366 0.1208 0.1337 0.1273 0.1272 0.1363
va: 1.2616 2.3940 2.1018 2.1890 2.9633 2.9575 3.9007 3.8949 3.8229 3.8707 3.8642 3.9010 3.9170 3.9518 4.3130 3.8878 3.8777 3.5741 3.8946 4.0502 4.0740 3.9244 3.9775 3.9062 4.1892 1.0229 1.0143 1.0137 1.0135 1.0125 1.0223 1.0099 1.0093 1.0123 1.0165 1.0068 1.0092 1.0108 1.0236 1.0063 1.0038 1.0032 1.0154 1.0258 1.0173 1.0050 1.0021 0.9949
dispcorr: -0.025498853 hartree
energy: -1856.335604282980
dipole: 86.59047 -84.68996 1.90051 19.36930 -19.78424 -0.41494 9.82861 -9.03684 0.79177
magnitude: 2.10024 au
magnitude: 5.33840 debye
