program: Orca
programVersion: 5.0.2
elementType: Cl S O O N N C C C C C C C C C C C C C C C C C C C H H H H H H H H H H H H H H H H H H H H H H H
charge: 0
multiplicity: 1
keywords: wb97x-d3
keywords: def2-TZVPP
keywords: def2/J RIJCOSX
keywords: DEFGRID2
keywords: scfconv7
keywords: smallprint printgap noloewdin
keywords: NOSOSCF
formula: C19H23ClN2O2S
InChI: InChI=1/C19H23ClN2O2S/c1-2-3-4-5-6-10-13-25-19(23)24-16-14-17(20)21-22-18(16)15-11-8-7-9-12-15/h7-9,11-12,14H,2-6,10,13H2,1H3
48 atoms
Cl -6.342495 -1.909145 -0.75059
S  0.753534 -1.771634 1.511116
O  -1.402765 -1.655118 0.21759
O  -1.267992 -0.076425 1.81957
N  -3.61914 0.675033 -1.445764
N  -4.764838 0.047953 -1.36307
C  3.906018 1.680219 0.92843
C  5.065274 1.496795 -0.046338
C  3.256292 0.376994 1.377379
C  6.269807 0.769636 0.540033
C  2.027484 0.610155 2.244371
C  7.447235 0.688081 -0.42329
C  1.414316 -0.667191 2.79474
C  8.648997 -0.033438 0.169117
C  -0.790683 -0.997469 1.238547
C  -2.526719 -1.086977 -0.308874
C  -2.500735 0.154091 -0.964862
C  -1.278318 0.961281 -1.138056
C  -0.066936 0.388565 -1.521021
C  -1.347576 2.339318 -0.945351
C  -3.713036 -1.761579 -0.222745
C  1.056193 1.181968 -1.697431
C  -0.22297 3.127212 -1.117697
C  0.982566 2.551171 -1.493198
C  -4.812294 -1.131076 -0.795341
H  3.141301 2.307411 0.460821
H  4.255461 2.235742 1.8055
H  5.386677 2.48078 -0.402008
H  4.712643 0.958332 -0.933544
H  3.977939 -0.23154 1.931942
H  2.974339 -0.207808 0.495718
H  5.987869 -0.243855 0.842029
H  6.5869 1.279416 1.456883
H  2.299962 1.233246 3.102783
H  1.274179 1.172884 1.687696
H  7.130825 0.181496 -1.340152
H  7.739132 1.698767 -0.724142
H  2.162768 -1.267764 3.31563
H  0.614576 -0.458095 3.504143
H  8.399294 -1.059594 0.443911
H  9.007138 0.468015 1.069698
H  9.479674 -0.075227 -0.535573
H  0.004567 -0.673364 -1.714464
H  -2.288451 2.788087 -0.657914
H  -3.791714 -2.719566 0.271571
H  1.989619 0.728159 -2.003456
H  -0.288414 4.195517 -0.960341
H  1.859977 3.168648 -1.634617
totalener: -1856.31003813 hartree
nucrepener: 2451.30820407 hartree
electener: -4307.61824220 hartree
oneelecener: -7414.29847986 hartree
twoeener: 3106.68023766 hartree
kineticenergy: 1850.65359978 hartree
xcener: -138.238154218593 hartree
chargesum: 0.0000000
charge: -0.038367 -0.035275 -0.291287 -0.306007 -0.103043 -0.150683 -0.149866 -0.119733 -0.129333 -0.103196 -0.132111 -0.085631 -0.146975 -0.253199 0.310019 0.147650 0.195696 0.070378 -0.165635 -0.125320 -0.169057 -0.164637 -0.126250 -0.119896 0.147005 0.073656 0.074733 0.069078 0.053625 0.074397 0.061407 0.053638 0.055206 0.079565 0.085067 0.053133 0.052438 0.114543 0.130873 0.071258 0.072152 0.085465 0.136906 0.120800 0.133633 0.128936 0.127298 0.136949
qa: -0.0384 -0.0353 -0.2913 -0.3060 -0.1030 -0.1507 -0.1499 -0.1197 -0.1293 -0.1032 -0.1321 -0.0856 -0.1470 -0.2532 0.3100 0.1477 0.1957 0.0704 -0.1656 -0.1253 -0.1691 -0.1646 -0.1262 -0.1199 0.1470 0.0737 0.0747 0.0691 0.0536 0.0744 0.0614 0.0536 0.0552 0.0796 0.0851 0.0531 0.0524 0.1145 0.1309 0.0713 0.0722 0.0855 0.1369 0.1208 0.1336 0.1289 0.1273 0.1369
va: 1.2615 2.3943 2.1017 2.1891 2.9632 2.9580 3.8987 3.8962 3.8215 3.8704 3.8628 3.9013 3.9188 3.9521 4.3134 3.8876 3.8787 3.5765 3.8961 4.0510 4.0739 3.9232 3.9778 3.9048 4.1890 1.0208 1.0142 1.0139 1.0138 1.0122 1.0225 1.0100 1.0095 1.0119 1.0165 1.0067 1.0091 1.0107 1.0234 1.0037 1.0033 1.0063 1.0155 1.0259 1.0174 1.0042 1.0020 0.9950
dispcorr: -0.025588777 hartree
energy: -1856.335626911402
dipole: 86.10426 -84.20537 1.89889 19.23127 -19.66966 -0.43839 9.44418 -8.66021 0.78396
magnitude: 2.10061 au
magnitude: 5.33932 debye
