program: Orca
programVersion: 5.0.2
elementType: Cl S O O N N C C C C C C C C C C C C C C C C C C C H H H H H H H H H H H H H H H H H H H H H H H
charge: 0
multiplicity: 1
keywords: wb97x-d3
keywords: def2-TZVPP
keywords: def2/J RIJCOSX
keywords: DEFGRID2
keywords: scfconv7
keywords: smallprint printgap noloewdin
keywords: NOSOSCF
formula: C19H23ClN2O2S
InChI: InChI=1/C19H23ClN2O2S/c1-2-3-4-5-6-10-13-25-19(23)24-16-14-17(20)21-22-18(16)15-11-8-7-9-12-15/h7-9,11-12,14H,2-6,10,13H2,1H3
48 atoms
Cl -6.205772 -0.764995 0.65623
S  0.243065 2.642014 -0.996327
O  -1.861357 1.26192 -0.909616
O  -0.353319 0.644172 0.647699
N  -2.940911 -2.188908 -0.717429
N  -4.142943 -2.058321 -0.2162
C  4.071023 0.72708 1.281192
C  5.489515 0.457695 1.770745
C  4.028537 1.087894 -0.199398
C  5.582274 0.039468 3.235204
C  2.623756 1.229309 -0.778862
C  5.182913 1.124602 4.228687
C  1.841901 2.385468 -0.174183
C  5.353458 0.684473 5.675551
C  -0.668957 1.345785 -0.258705
C  -2.625676 0.155827 -0.676793
C  -2.17695 -1.140067 -0.978864
C  -0.852954 -1.424782 -1.56466
C  -0.082515 -2.454664 -1.030625
C  -0.368489 -0.705535 -2.654609
C  -3.884177 0.311747 -0.16297
C  1.160012 -2.746946 -1.566199
C  0.871353 -1.009431 -3.195867
C  1.640411 -2.025341 -2.650488
C  -4.608915 -0.859359 0.031494
H  3.62313 1.529892 1.873359
H  3.450637 -0.158513 1.455597
H  6.106477 1.348284 1.607691
H  5.930523 -0.328621 1.150021
H  4.550478 0.312559 -0.768186
H  4.592874 2.01174 -0.367971
H  6.609948 -0.270361 3.449423
H  4.962237 -0.848594 3.398838
H  2.692733 1.38002 -1.858577
H  2.072018 0.297772 -0.634983
H  5.785628 2.019686 4.044734
H  4.143656 1.42103 4.064826
H  1.663844 2.259142 0.892695
H  2.374336 3.329853 -0.306835
H  5.071281 1.475207 6.370929
H  6.388834 0.41304 5.887895
H  4.734707 -0.18584 5.899269
H  -0.461105 -3.019143 -0.189569
H  -0.963715 0.077696 -3.105176
H  -4.282856 1.284608 0.088268
H  1.753656 -3.543612 -1.138068
H  1.233431 -0.450705 -4.048544
H  2.609969 -2.25809 -3.071063
totalener: -1856.30821851 hartree
nucrepener: 2442.14684070 hartree
electener: -4298.45505921 hartree
oneelecener: -7396.10492622 hartree
twoeener: 3097.64986701 hartree
kineticenergy: 1850.65057293 hartree
xcener: -138.236878905052 hartree
chargesum: 0.0000000
charge: -0.038512 -0.034367 -0.288307 -0.303876 -0.101291 -0.149629 -0.106477 -0.121333 -0.129772 -0.122128 -0.123007 -0.084568 -0.128178 -0.259685 0.304786 0.148901 0.194577 0.051205 -0.110729 -0.147674 -0.175331 -0.138588 -0.171465 -0.102688 0.147914 0.052675 0.071089 0.058728 0.068588 0.068409 0.065026 0.067929 0.057352 0.082715 0.059746 0.053935 0.054067 0.114304 0.116099 0.083672 0.072788 0.074873 0.119391 0.134697 0.134485 0.126814 0.125268 0.127576
qa: -0.0385 -0.0344 -0.2883 -0.3039 -0.1013 -0.1496 -0.1065 -0.1213 -0.1298 -0.1221 -0.1230 -0.0846 -0.1282 -0.2597 0.3048 0.1489 0.1946 0.0512 -0.1107 -0.1477 -0.1753 -0.1386 -0.1715 -0.1027 0.1479 0.0527 0.0711 0.0587 0.0686 0.0684 0.0650 0.0679 0.0574 0.0827 0.0597 0.0539 0.0541 0.1143 0.1161 0.0837 0.0728 0.0749 0.1194 0.1347 0.1345 0.1268 0.1253 0.1276
va: 1.2611 2.4067 2.1067 2.1894 2.9651 2.9549 3.8550 3.9030 3.9193 3.9037 3.9000 3.8698 3.9184 3.9601 4.3179 3.8869 3.8703 3.5872 4.0263 3.8821 4.0711 3.9560 3.9391 3.8930 4.1885 1.0123 1.0090 1.0104 1.0131 1.0156 1.0098 1.0112 1.0108 1.0173 1.0205 1.0064 1.0083 1.0260 1.0104 1.0057 1.0039 1.0029 1.0251 1.0147 1.0173 1.0021 1.0053 0.9995
dispcorr: -0.024776182 hartree
energy: -1856.332994687810
dipole: 78.30381 -76.74893 1.55487 8.39576 -7.04705 1.34870 22.15093 -22.49682 -0.34589
magnitude: 2.08717 au
magnitude: 5.30516 debye
