program: Orca
programVersion: 5.0.2
elementType: Cl S O O N N C C C C C C C C C C C C C C C C C C C H H H H H H H H H H H H H H H H H H H H H H H
charge: 0
multiplicity: 1
keywords: wb97x-d3
keywords: def2-TZVPP
keywords: def2/J RIJCOSX
keywords: DEFGRID2
keywords: scfconv7
keywords: smallprint printgap noloewdin
keywords: NOSOSCF
formula: C19H23ClN2O2S
InChI: InChI=1/C19H23ClN2O2S/c1-2-3-4-5-6-10-13-25-19(23)24-16-14-17(20)21-22-18(16)15-11-8-7-9-12-15/h7-9,11-12,14H,2-6,10,13H2,1H3
48 atoms
Cl -6.253369 -1.9034 -0.798348
S  0.866217 -1.988706 1.350674
O  -1.289053 -1.756218 0.072599
O  -1.16761 -0.35126 1.830101
N  -3.525706 0.712872 -1.341376
N  -4.674289 0.087874 -1.282781
C  3.734708 1.737049 1.171086
C  4.825163 1.801181 0.106617
C  3.187422 0.33736 1.420784
C  6.086774 1.01811 0.452663
C  2.018628 0.346094 2.395025
C  7.208225 1.205685 -0.56152
C  1.506336 -1.037374 2.760677
C  8.463768 0.421806 -0.206921
C  -0.682519 -1.203096 1.156691
C  -2.422216 -1.14517 -0.38233
C  -2.400885 0.145554 -0.933836
C  -1.172889 0.951339 -1.072174
C  0.015924 0.398142 -1.544222
C  -1.213455 2.308295 -0.759344
C  -3.611001 -1.817618 -0.323908
C  1.144664 1.189051 -1.692471
C  -0.081453 3.09257 -0.899974
C  1.10097 2.535771 -1.366704
C  -4.718164 -1.134386 -0.815382
H  2.906642 2.386225 0.871525
H  4.120328 2.151378 2.108904
H  5.09311 2.849278 -0.060044
H  4.423301 1.439271 -0.846945
H  3.977737 -0.313449 1.808714
H  2.867588 -0.099616 0.469712
H  5.855347 -0.048466 0.53341
H  6.441051 1.324355 1.443596
H  2.325086 0.830284 3.328312
H  1.20102 0.95014 1.996156
H  6.855417 0.904001 -1.552465
H  7.45073 2.269673 -0.640624
H  2.311284 -1.658423 3.159289
H  0.726746 -0.990256 3.520238
H  8.85871 0.725664 0.763869
H  9.25277 0.572248 -0.94382
H  8.261679 -0.649392 -0.15626
H  0.063673 -0.64411 -1.829724
H  -2.137204 2.743296 -0.403281
H  -3.686048 -2.812503 0.091793
H  2.058592 0.75118 -2.071665
H  -0.123698 4.143965 -0.648653
H  1.984115 3.15049 -1.483027
totalener: -1856.31010957 hartree
nucrepener: 2463.61162114 hartree
electener: -4319.92173071 hartree
oneelecener: -7438.92918410 hartree
twoeener: 3119.00745339 hartree
kineticenergy: 1850.65883151 hartree
xcener: -138.239453619759 hartree
chargesum: 0.0000000
charge: -0.038319 -0.033747 -0.292248 -0.308366 -0.103106 -0.149953 -0.146463 -0.132410 -0.130268 -0.102101 -0.135764 -0.086605 -0.150007 -0.253883 0.312104 0.143526 0.196477 0.081203 -0.175356 -0.127320 -0.166201 -0.162005 -0.123147 -0.129453 0.146026 0.078316 0.077935 0.070596 0.051045 0.076739 0.061198 0.053931 0.056209 0.079890 0.089714 0.052745 0.053188 0.115276 0.130439 0.072546 0.085395 0.071364 0.134175 0.120262 0.133505 0.134004 0.127528 0.141384
qa: -0.0383 -0.0337 -0.2922 -0.3084 -0.1031 -0.1500 -0.1465 -0.1324 -0.1303 -0.1021 -0.1358 -0.0866 -0.1500 -0.2539 0.3121 0.1435 0.1965 0.0812 -0.1754 -0.1273 -0.1662 -0.1620 -0.1231 -0.1295 0.1460 0.0783 0.0779 0.0706 0.0510 0.0767 0.0612 0.0539 0.0562 0.0799 0.0897 0.0527 0.0532 0.1153 0.1304 0.0725 0.0854 0.0714 0.1342 0.1203 0.1335 0.1340 0.1275 0.1414
va: 1.2616 2.3964 2.1005 2.1876 2.9651 2.9579 3.8900 3.8984 3.8155 3.8741 3.8514 3.9035 3.9268 3.9522 4.3107 3.8862 3.8747 3.5703 3.9137 4.0500 4.0758 3.9112 3.9684 3.8924 4.1898 1.0158 1.0129 1.0141 1.0138 1.0116 1.0249 1.0095 1.0094 1.0115 1.0183 1.0064 1.0091 1.0099 1.0218 1.0032 1.0064 1.0039 1.0161 1.0261 1.0172 1.0006 1.0022 0.9933
dispcorr: -0.025994808 hartree
energy: -1856.336104374193
dipole: 83.83908 -81.94882 1.89026 21.30869 -21.82647 -0.51779 9.64980 -8.92588 0.72392
magnitude: 2.08932 au
magnitude: 5.31063 debye
