program: Orca
programVersion: 5.0.2
elementType: Cl S O O N N C C C C C C C C C C C C C C C C C C C H H H H H H H H H H H H H H H H H H H H H H H
charge: 0
multiplicity: 1
keywords: wb97x-d3
keywords: def2-TZVPP
keywords: def2/J RIJCOSX
keywords: DEFGRID2
keywords: scfconv7
keywords: smallprint printgap noloewdin
keywords: NOSOSCF
formula: C19H23ClN2O2S
InChI: InChI=1/C19H23ClN2O2S/c1-2-3-4-5-6-10-13-25-19(23)24-16-14-17(20)21-22-18(16)15-11-8-7-9-12-15/h7-9,11-12,14H,2-6,10,13H2,1H3
48 atoms
Cl -6.254498 -1.83482 -0.812605
S  0.932102 -2.15502 1.098834
O  -1.265556 -1.797307 -0.070764
O  -1.098854 -0.612806 1.839956
N  -3.524438 0.810461 -1.163028
N  -4.674772 0.188217 -1.136344
C  3.70158 1.642574 1.374289
C  4.675215 1.929655 0.236741
C  3.217181 0.198869 1.438142
C  5.975152 1.136356 0.293141
C  2.087758 0.025852 2.443466
C  6.961764 1.539728 -0.796537
C  1.607045 -1.406469 2.612127
C  8.253405 0.735645 -0.756342
C  -0.629992 -1.372842 1.054772
C  -2.407641 -1.138911 -0.4271
C  -2.392589 0.20072 -0.845281
C  -1.164921 1.0128 -0.936219
C  0.01468 0.499803 -1.472395
C  -1.197616 2.339311 -0.5115
C  -3.599345 -1.809029 -0.405105
C  1.143101 1.2986 -1.569727
C  -0.066138 3.131282 -0.603821
C  1.108206 2.612983 -1.131112
C  -4.714821 -1.07515 -0.793066
H  2.831301 2.296393 1.263404
H  4.165079 1.914928 2.328528
H  4.911845 2.998535 0.237741
H  4.178334 1.734783 -0.720934
H  4.045632 -0.467681 1.698942
H  2.871923 -0.110641 0.446867
H  5.765707 0.065425 0.206251
H  6.442966 1.272373 1.275134
H  2.421249 0.368705 3.428744
H  1.246183 0.665781 2.170222
H  6.487281 1.421932 -1.775867
H  7.190016 2.605593 -0.701102
H  2.432074 -2.066058 2.88873
H  0.852792 -1.485514 3.394504
H  8.943691 1.043154 -1.542028
H  8.060566 -0.330577 -0.887393
H  8.766391 0.859405 0.199183
H  0.055643 -0.513929 -1.847214
H  -2.115519 2.744364 -0.108112
H  -3.670054 -2.84119 -0.091902
H  2.049549 0.891807 -1.998294
H  -0.102658 4.158677 -0.266839
H  1.991836 3.233299 -1.20686
totalener: -1856.31001672 hartree
nucrepener: 2468.52117536 hartree
electener: -4324.83119208 hartree
oneelecener: -7448.74646578 hartree
twoeener: 3123.91527370 hartree
kineticenergy: 1850.65469780 hartree
xcener: -138.238836136638 hartree
chargesum: -0.0000000
charge: -0.038187 -0.033531 -0.293269 -0.307856 -0.103584 -0.150732 -0.133222 -0.143693 -0.131954 -0.100251 -0.135035 -0.086587 -0.151355 -0.254377 0.311420 0.143478 0.196270 0.084699 -0.179643 -0.127615 -0.164739 -0.161691 -0.129005 -0.120556 0.145942 0.075775 0.081144 0.073599 0.044529 0.076459 0.060411 0.053926 0.057160 0.079871 0.090252 0.052507 0.053553 0.114849 0.130739 0.085568 0.071461 0.072335 0.135661 0.120819 0.133471 0.133884 0.127260 0.139837
qa: -0.0382 -0.0335 -0.2933 -0.3079 -0.1036 -0.1507 -0.1332 -0.1437 -0.1320 -0.1003 -0.1350 -0.0866 -0.1514 -0.2544 0.3114 0.1435 0.1963 0.0847 -0.1796 -0.1276 -0.1647 -0.1617 -0.1290 -0.1206 0.1459 0.0758 0.0811 0.0736 0.0445 0.0765 0.0604 0.0539 0.0572 0.0799 0.0903 0.0525 0.0536 0.1148 0.1307 0.0856 0.0715 0.0723 0.1357 0.1208 0.1335 0.1339 0.1273 0.1398
va: 1.2617 2.3964 2.0984 2.1885 2.9643 2.9587 3.8738 3.9064 3.8209 3.8730 3.8518 3.9025 3.9294 3.9534 4.3129 3.8870 3.8795 3.5685 3.9188 4.0484 4.0757 3.9047 3.9803 3.8881 4.1899 1.0144 1.0124 1.0136 1.0149 1.0114 1.0243 1.0097 1.0101 1.0109 1.0186 1.0058 1.0089 1.0100 1.0204 1.0064 1.0036 1.0032 1.0158 1.0264 1.0171 1.0000 1.0023 0.9928
dispcorr: -0.026129718 hartree
energy: -1856.336146435432
dipole: 82.79845 -80.89770 1.90075 21.68641 -22.28505 -0.59864 8.86934 -8.24280 0.62654
magnitude: 2.08897 au
magnitude: 5.30973 debye
