program: Orca
programVersion: 5.0.2
elementType: Cl S O O N N C C C C C C C C C C C C C C C C C C C H H H H H H H H H H H H H H H H H H H H H H H
charge: 0
multiplicity: 1
keywords: wb97x-d3
keywords: def2-TZVPP
keywords: def2/J RIJCOSX
keywords: DEFGRID2
keywords: scfconv7
keywords: smallprint printgap noloewdin
keywords: NOSOSCF
formula: C19H23ClN2O2S
InChI: InChI=1/C19H23ClN2O2S/c1-2-3-4-5-6-10-13-25-19(23)24-16-14-17(20)21-22-18(16)15-11-8-7-9-12-15/h7-9,11-12,14H,2-6,10,13H2,1H3
48 atoms
Cl -5.927256 -1.48769 -1.761669
S  0.424185 -1.968823 2.147809
O  -1.718926 -1.267561 1.009526
O  -0.14432 -1.958856 -0.443872
N  -2.848677 0.771519 -1.759311
N  -3.992378 0.204663 -2.051607
C  4.718998 -0.018992 -0.309596
C  5.019987 1.094109 0.686747
C  4.092866 -1.265012 0.311648
C  5.673675 2.306682 0.035063
C  2.714639 -1.006599 0.909887
C  6.063194 3.409821 1.01502
C  2.059843 -2.280071 1.419144
C  4.883192 4.046994 1.737277
C  -0.490122 -1.743514 0.673585
C  -2.486059 -0.777182 -0.00798
C  -2.092341 0.340291 -0.762587
C  -0.832328 1.072758 -0.53078
C  -0.426393 1.443661 0.749239
C  -0.044204 1.426385 -1.623681
C  -3.683838 -1.372765 -0.289664
C  0.749843 2.154977 0.930245
C  1.136027 2.125191 -1.437361
C  1.535878 2.49266 -0.160152
C  -4.407047 -0.811218 -1.337172
H  5.645958 -0.303764 -0.816378
H  4.052913 0.363938 -1.090185
H  5.675611 0.708698 1.476274
H  4.09506 1.399173 1.183081
H  4.763512 -1.66885 1.078066
H  4.008505 -2.038582 -0.457551
H  4.99904 2.716891 -0.725567
H  6.567573 1.981521 -0.506001
H  2.782324 -0.293765 1.734022
H  2.077763 -0.542012 0.153984
H  6.765485 3.006506 1.751269
H  6.610029 4.186473 0.474121
H  1.956189 -3.03091 0.635702
H  2.641854 -2.728804 2.226581
H  4.347938 3.330494 2.361918
H  4.166811 4.469802 1.029007
H  5.209518 4.858372 2.388225
H  -1.036973 1.206523 1.610402
H  -0.36141 1.146527 -2.618927
H  -4.03751 -2.236524 0.255437
H  1.050082 2.447481 1.927588
H  1.744061 2.388382 -2.292751
H  2.456749 3.042829 -0.015785
totalener: -1856.30852034 hartree
nucrepener: 2499.13129328 hartree
electener: -4355.43981362 hartree
oneelecener: -7509.92718235 hartree
twoeener: 3154.48736873 hartree
kineticenergy: 1850.65197309 hartree
xcener: -138.239346826511 hartree
chargesum: -0.0000000
charge: -0.038759 -0.030704 -0.289639 -0.304835 -0.101984 -0.150209 -0.110514 -0.116978 -0.142595 -0.138053 -0.106254 -0.087425 -0.136852 -0.281639 0.304087 0.144289 0.189097 0.038915 -0.128771 -0.079858 -0.171225 -0.179396 -0.176258 -0.072764 0.148539 0.077508 0.061572 0.073629 0.029297 0.064113 0.079128 0.060891 0.073061 0.069394 0.065358 0.053123 0.070323 0.116980 0.115730 0.078230 0.077264 0.097544 0.133353 0.119409 0.134345 0.122075 0.125147 0.122314
qa: -0.0388 -0.0307 -0.2896 -0.3048 -0.1020 -0.1502 -0.1105 -0.1170 -0.1426 -0.1381 -0.1063 -0.0874 -0.1369 -0.2816 0.3041 0.1443 0.1891 0.0389 -0.1288 -0.0799 -0.1712 -0.1794 -0.1763 -0.0728 0.1485 0.0775 0.0616 0.0736 0.0293 0.0641 0.0791 0.0609 0.0731 0.0694 0.0654 0.0531 0.0703 0.1170 0.1157 0.0782 0.0773 0.0975 0.1334 0.1194 0.1343 0.1221 0.1251 0.1223
va: 1.2611 2.4018 2.1058 2.1897 2.9657 2.9558 3.8836 3.8497 3.9361 3.8954 3.8414 3.8795 3.9457 3.9372 4.3200 3.8934 3.8771 3.5939 3.8683 3.9998 4.0754 3.9444 3.9775 3.8342 4.1882 1.0151 1.0160 1.0140 1.0113 1.0104 1.0118 1.0085 1.0158 1.0137 1.0205 1.0098 1.0091 1.0258 1.0101 0.9980 1.0000 1.0086 1.0148 1.0242 1.0173 1.0068 1.0059 0.9948
dispcorr: -0.027864435 hartree
energy: -1856.336384776965
dipole: 76.93873 -75.34508 1.59365 23.70544 -24.13509 -0.42965 13.42883 -12.11767 1.31116
magnitude: 2.10795 au
magnitude: 5.35798 debye
