program: Orca
programVersion: 5.0.2
elementType: Cl S O O N N C C C C C C C C C C C C C C C C C C C H H H H H H H H H H H H H H H H H H H H H H H
charge: 0
multiplicity: 1
keywords: wb97x-d3
keywords: def2-TZVPP
keywords: def2/J RIJCOSX
keywords: DEFGRID2
keywords: scfconv7
keywords: smallprint printgap noloewdin
keywords: NOSOSCF
formula: C19H23ClN2O2S
InChI: InChI=1/C19H23ClN2O2S/c1-2-3-4-5-6-10-13-25-19(23)24-16-14-17(20)21-22-18(16)15-11-8-7-9-12-15/h7-9,11-12,14H,2-6,10,13H2,1H3
48 atoms
Cl -6.319326 -1.724027 -0.946047
S  0.5306 -1.813283 1.980962
O  -1.696729 -1.196603 0.991142
O  -0.343751 -2.22056 -0.49409
N  -3.226474 0.280962 -1.938818
N  -4.416459 -0.262152 -1.911942
C  4.344944 0.618409 0.648008
C  4.839933 1.739078 1.553199
C  3.3757 -0.319954 1.35377
C  5.903031 2.621872 0.911999
C  2.842362 -1.42368 0.451224
C  6.405608 3.722105 1.838177
C  2.02845 -2.473879 1.190908
C  7.495338 4.579236 1.209982
C  -0.539086 -1.793593 0.598249
C  -2.605488 -0.883914 0.022606
C  -2.320469 0.026267 -1.007144
C  -1.02951 0.726481 -1.144401
C  -0.455171 0.84036 -2.408135
C  -0.388687 1.305804 -0.05105
C  -3.849315 -1.450624 0.074548
C  0.746257 1.506869 -2.573261
C  0.810121 1.981159 -0.222124
C  1.382704 2.079227 -1.480915
C  -4.72906 -1.076967 -0.935279
H  5.201991 0.044599 0.279071
H  3.862856 1.043198 -0.238408
H  5.244127 1.305495 2.474419
H  3.990367 2.357058 1.864869
H  2.537724 0.256349 1.75702
H  3.880302 -0.766825 2.218233
H  5.506845 3.0705 -0.005614
H  6.7483 1.999529 0.598795
H  2.248684 -0.996766 -0.360613
H  3.680636 -1.943867 -0.024181
H  5.565598 4.356634 2.136498
H  6.782284 3.270879 2.761034
H  1.733386 -3.29368 0.537204
H  2.604552 -2.903042 2.013258
H  7.833173 5.360681 1.890719
H  7.141906 5.06655 0.299858
H  8.365741 3.978392 0.941535
H  -0.955548 0.399457 -3.259265
H  -0.831582 1.261696 0.935084
H  -4.124489 -2.15558 0.846322
H  1.18594 1.582273 -3.55876
H  1.294789 2.436225 0.63173
H  2.319042 2.605864 -1.611769
totalener: -1856.31088141 hartree
nucrepener: 2445.71260273 hartree
electener: -4302.02348415 hartree
oneelecener: -7403.09755977 hartree
twoeener: 3101.07407562 hartree
kineticenergy: 1850.65436188 hartree
xcener: -138.237480506116 hartree
chargesum: -0.0000000
charge: -0.038171 -0.035483 -0.290353 -0.305227 -0.102506 -0.150926 -0.140797 -0.096797 -0.124613 -0.105560 -0.124789 -0.078352 -0.152252 -0.257779 0.311588 0.149481 0.193844 0.066819 -0.119344 -0.160326 -0.171990 -0.134273 -0.172943 -0.104198 0.147685 0.069408 0.056174 0.057546 0.052021 0.061598 0.072603 0.052457 0.052180 0.085268 0.078037 0.052441 0.051730 0.130856 0.116435 0.085163 0.072655 0.072553 0.119131 0.136395 0.133895 0.127008 0.128307 0.133401
qa: -0.0382 -0.0355 -0.2904 -0.3052 -0.1025 -0.1509 -0.1408 -0.0968 -0.1246 -0.1056 -0.1248 -0.0784 -0.1523 -0.2578 0.3116 0.1495 0.1938 0.0668 -0.1193 -0.1603 -0.1720 -0.1343 -0.1729 -0.1042 0.1477 0.0694 0.0562 0.0575 0.0520 0.0616 0.0726 0.0525 0.0522 0.0853 0.0780 0.0524 0.0517 0.1309 0.1164 0.0852 0.0727 0.0726 0.1191 0.1364 0.1339 0.1270 0.1283 0.1334
va: 1.2617 2.3924 2.1030 2.1911 2.9635 2.9576 3.8909 3.8654 3.8357 3.8952 3.8518 3.8895 3.9199 3.9559 4.3122 3.8842 3.8764 3.5810 4.0460 3.8914 4.0720 3.9855 3.9329 3.9016 4.1889 1.0163 1.0210 1.0134 1.0139 1.0238 1.0141 1.0108 1.0115 1.0163 1.0127 1.0076 1.0080 1.0243 1.0094 1.0063 1.0030 1.0033 1.0260 1.0156 1.0176 1.0023 1.0029 0.9969
dispcorr: -0.025435457 hartree
energy: -1856.336316868737
dipole: 83.70447 -81.99997 1.70450 28.74355 -29.03515 -0.29160 13.64333 -12.42263 1.22071
magnitude: 2.11671 au
magnitude: 5.38025 debye
