program: Orca
programVersion: 5.0.2
elementType: Cl S O O N N C C C C C C C C C C C C C C C C C C C H H H H H H H H H H H H H H H H H H H H H H H
charge: 0
multiplicity: 1
keywords: wb97x-d3
keywords: def2-TZVPP
keywords: def2/J RIJCOSX
keywords: DEFGRID2
keywords: scfconv7
keywords: smallprint printgap noloewdin
keywords: NOSOSCF
formula: C19H23ClN2O2S
InChI: InChI=1/C19H23ClN2O2S/c1-2-3-4-5-6-10-13-25-19(23)24-16-14-17(20)21-22-18(16)15-11-8-7-9-12-15/h7-9,11-12,14H,2-6,10,13H2,1H3
48 atoms
Cl -6.287323 -0.788773 0.361254
S  0.829219 -3.053361 0.141975
O  -1.463556 -2.091957 -0.320401
O  -0.409226 -1.062697 1.381542
N  -3.135557 1.099131 -0.679858
N  -4.362298 0.789427 -0.343653
C  4.421026 0.754718 0.812641
C  5.271125 1.605408 1.745676
C  3.792358 -0.458144 1.488855
C  6.004063 2.745931 1.041268
C  2.784097 -1.137835 0.571034
C  5.11668 3.685724 0.227017
C  2.154788 -2.376525 1.186455
C  4.011426 4.353394 1.034476
C  -0.42136 -1.892867 0.529994
C  -2.43658 -1.134078 -0.334667
C  -2.171858 0.192507 -0.711226
C  -0.838777 0.666631 -1.131204
C  -0.345051 1.861068 -0.611593
C  -0.075676 -0.039669 -2.058124
C  -3.715305 -1.478222 0.005778
C  0.898192 2.331296 -0.999936
C  1.163126 0.440804 -2.454504
C  1.655866 1.622171 -1.922168
C  -4.651206 -0.450227 -0.035521
H  5.026963 0.422326 -0.037843
H  3.619039 1.36557 0.386719
H  6.010663 0.972018 2.245593
H  4.637654 2.003494 2.544658
H  3.286509 -0.143679 2.407306
H  4.57424 -1.161446 1.79416
H  6.765315 2.322988 0.378135
H  6.54981 3.329692 1.788839
H  2.003996 -0.416297 0.320844
H  3.260657 -1.409962 -0.374663
H  5.749016 4.455836 -0.222235
H  4.675925 3.143482 -0.615131
H  2.878787 -3.186948 1.28711
H  1.746001 -2.179534 2.177567
H  4.417591 4.898173 1.888382
H  3.293404 3.628787 1.42176
H  3.456002 5.067713 0.425574
H  -0.939621 2.415468 0.101669
H  -0.452344 -0.9543 -2.497132
H  -3.977406 -2.483337 0.304663
H  1.27714 3.255646 -0.583163
H  1.742575 -0.112225 -3.181642
H  2.62665 1.992479 -2.225692
totalener: -1856.30834364 hartree
nucrepener: 2490.91501266 hartree
electener: -4347.22335631 hartree
oneelecener: -7493.56251673 hartree
twoeener: 3146.33916042 hartree
kineticenergy: 1850.64787999 hartree
xcener: -138.238804897160 hartree
chargesum: -0.0000000
charge: -0.038273 -0.031233 -0.288716 -0.305318 -0.099713 -0.150426 -0.052006 -0.136875 -0.141566 -0.149735 -0.072092 -0.094117 -0.136515 -0.278348 0.304241 0.141293 0.193742 0.054819 -0.101443 -0.158813 -0.171753 -0.121948 -0.135156 -0.141621 0.147524 0.068731 -0.003637 0.070959 0.069612 0.069579 0.061941 0.068392 0.074713 0.038782 0.073740 0.075859 0.044125 0.116224 0.114437 0.089594 0.071974 0.091664 0.117995 0.130535 0.133566 0.130636 0.123678 0.130948
qa: -0.0383 -0.0312 -0.2887 -0.3053 -0.0997 -0.1504 -0.0520 -0.1369 -0.1416 -0.1497 -0.0721 -0.0941 -0.1365 -0.2783 0.3042 0.1413 0.1937 0.0548 -0.1014 -0.1588 -0.1718 -0.1219 -0.1352 -0.1416 0.1475 0.0687 -0.0036 0.0710 0.0696 0.0696 0.0619 0.0684 0.0747 0.0388 0.0737 0.0759 0.0441 0.1162 0.1144 0.0896 0.0720 0.0917 0.1180 0.1305 0.1336 0.1306 0.1237 0.1309
va: 1.2615 2.4034 2.1081 2.1873 2.9654 2.9551 3.8430 3.9088 3.9417 3.9066 3.8583 3.8558 3.9397 3.9336 4.3166 3.8946 3.8685 3.5843 4.0332 3.9058 4.0745 3.8987 3.9318 3.8935 4.1887 1.0104 1.0357 1.0134 1.0019 1.0104 1.0137 1.0108 1.0099 1.0241 1.0151 1.0105 1.0103 1.0104 1.0255 1.0070 0.9969 1.0038 1.0259 1.0161 1.0175 1.0006 1.0050 0.9994
dispcorr: -0.027277028 hartree
energy: -1856.335620670716
dipole: 75.40617 -73.60056 1.80561 25.94825 -26.96418 -1.01593 8.09858 -8.08423 0.01435
magnitude: 2.07185 au
magnitude: 5.26622 debye
