program: Orca
programVersion: 5.0.2
elementType: Cl S O O N N C C C C C C C C C C C C C C C C C C C H H H H H H H H H H H H H H H H H H H H H H H
charge: 0
multiplicity: 1
keywords: wb97x-d3
keywords: def2-TZVPP
keywords: def2/J RIJCOSX
keywords: DEFGRID2
keywords: scfconv7
keywords: smallprint printgap noloewdin
keywords: NOSOSCF
formula: C19H23ClN2O2S
InChI: InChI=1/C19H23ClN2O2S/c1-2-3-4-5-6-10-13-25-19(23)24-16-14-17(20)21-22-18(16)15-11-8-7-9-12-15/h7-9,11-12,14H,2-6,10,13H2,1H3
48 atoms
Cl -5.7989 -0.186987 1.091515
S  1.004674 -3.094061 0.249822
O  -1.231328 -1.981079 -0.05426
O  0.198216 -0.729296 1.156064
N  -2.807223 1.184337 -0.842923
N  -3.968697 1.048226 -0.255862
C  4.320655 0.104072 1.5501
C  3.48913 1.283684 1.061487
C  4.575828 -0.958766 0.481942
C  3.313375 2.362159 2.123572
C  3.318506 -1.60091 -0.101517
C  2.454664 3.538651 1.668814
C  2.556776 -2.431103 0.920077
C  3.098896 4.386918 0.579969
C  -0.038742 -1.720218 0.542139
C  -2.143339 -0.967012 -0.11941
C  -1.895415 0.2245 -0.819876
C  -0.634231 0.503357 -1.531835
C  -0.032951 -0.449095 -2.351477
C  -0.042788 1.757263 -1.397585
C  -3.356611 -1.131119 0.490622
C  1.150667 -0.155398 -3.010742
C  1.142304 2.044222 -2.052495
C  1.745785 1.087099 -2.856208
C  -4.245276 -0.0683 0.370208
H  3.838288 -0.342493 2.425768
H  5.287609 0.470506 1.908079
H  2.498485 0.944244 0.746827
H  3.963135 1.704235 0.168354
H  5.226215 -1.738268 0.891999
H  5.137819 -0.504777 -0.339474
H  4.294259 2.729866 2.445587
H  2.855178 1.909915 3.008465
H  2.662894 -0.832956 -0.516198
H  3.594798 -2.24364 -0.94074
H  1.488041 3.161274 1.320713
H  2.237108 4.17496 2.53039
H  3.134799 -3.304714 1.227176
H  2.318573 -1.868542 1.821688
H  4.055023 4.794383 0.913229
H  2.462914 5.228616 0.304152
H  3.289232 3.812286 -0.327161
H  -0.493321 -1.416602 -2.50214
H  -0.514518 2.503501 -0.77295
H  -3.602454 -2.027217 1.042772
H  1.605104 -0.901478 -3.648726
H  1.596425 3.01893 -1.933647
H  2.67313 1.312388 -3.366178
totalener: -1856.30819352 hartree
nucrepener: 2552.66242804 hartree
electener: -4408.97062156 hartree
oneelecener: -7617.18729980 hartree
twoeener: 3208.21667825 hartree
kineticenergy: 1850.65294448 hartree
xcener: -138.240685352619 hartree
chargesum: 0.0000000
charge: -0.037903 -0.032778 -0.287994 -0.313873 -0.101939 -0.150879 -0.141375 -0.078378 -0.148295 -0.108669 -0.099324 -0.107758 -0.125943 -0.263507 0.314455 0.146317 0.195734 0.060184 -0.142506 -0.108146 -0.172382 -0.179936 -0.188182 -0.062782 0.147642 0.061031 0.072503 0.040526 0.059622 0.076243 0.074779 0.056981 0.067736 0.020639 0.089593 0.054744 0.073120 0.119448 0.114284 0.081850 0.092570 0.054264 0.134575 0.120577 0.134322 0.124057 0.137925 0.126828
qa: -0.0379 -0.0328 -0.2880 -0.3139 -0.1019 -0.1509 -0.1414 -0.0784 -0.1483 -0.1087 -0.0993 -0.1078 -0.1259 -0.2635 0.3145 0.1463 0.1957 0.0602 -0.1425 -0.1081 -0.1724 -0.1799 -0.1882 -0.0628 0.1476 0.0610 0.0725 0.0405 0.0596 0.0762 0.0748 0.0570 0.0677 0.0206 0.0896 0.0547 0.0731 0.1194 0.1143 0.0819 0.0926 0.0543 0.1346 0.1206 0.1343 0.1241 0.1379 0.1268
va: 1.2618 2.4085 2.1074 2.1712 2.9631 2.9560 3.9109 3.8448 3.9344 3.9024 3.8960 3.8959 3.8968 3.9253 4.2995 3.8891 3.8711 3.5967 3.8728 3.9815 4.0719 3.9526 3.9483 3.8600 4.1892 1.0086 1.0134 1.0094 1.0086 1.0096 1.0113 1.0107 1.0121 1.0227 1.0172 1.0149 1.0103 1.0103 1.0278 1.0066 1.0038 1.0058 1.0149 1.0271 1.0176 1.0050 0.9957 0.9994
dispcorr: -0.028493627 hartree
energy: -1856.336687146978
dipole: 63.58234 -61.95786 1.62448 19.80419 -21.01130 -1.20711 4.44679 -4.40156 0.04523
magnitude: 2.02438 au
magnitude: 5.14555 debye
