program: Orca
programVersion: 5.0.2
elementType: Cl S O O N N C C C C C C C C C C C C C C C C C C C H H H H H H H H H H H H H H H H H H H H H H H
charge: 0
multiplicity: 1
keywords: wb97x-d3
keywords: def2-TZVPP
keywords: def2/J RIJCOSX
keywords: DEFGRID2
keywords: scfconv7
keywords: smallprint printgap noloewdin
keywords: NOSOSCF
formula: C19H23ClN2O2S
InChI: InChI=1/C19H23ClN2O2S/c1-2-3-4-5-6-10-13-25-19(23)24-16-14-17(20)21-22-18(16)15-11-8-7-9-12-15/h7-9,11-12,14H,2-6,10,13H2,1H3
48 atoms
Cl -6.212504 -1.057872 0.086686
S  0.934008 -0.276516 2.082443
O  -1.235284 -0.805194 0.900856
O  -0.981101 1.392811 1.320782
N  -3.253061 0.353794 -1.869358
N  -4.455514 0.015155 -1.478745
C  4.641612 1.047194 1.402627
C  5.771161 0.340198 0.655876
C  3.393771 1.268437 0.557672
C  5.420989 -1.042502 0.10924
C  2.283072 2.03753 1.261789
C  4.926212 -2.027037 1.162216
C  1.68739 1.332649 2.472854
C  4.71796 -3.427777 0.60475
C  -0.567982 0.279161 1.381205
C  -2.317002 -0.549595 0.10628
C  -2.182677 0.079259 -1.141081
C  -0.880432 0.492977 -1.6970
C  0.218091 -0.364087 -1.687784
C  -0.754069 1.756348 -2.268762
C  -3.563828 -0.926417 0.522264
C  1.424819 0.041998 -2.235842
C  0.456573 2.162848 -2.80375
C  1.549396 1.307424 -2.788098
C  -4.608873 -0.619544 -0.343678
H  5.009033 2.014705 1.759821
H  4.395993 0.47632 2.303491
H  6.630692 0.247825 1.326681
H  6.103863 0.974062 -0.171997
H  2.993507 0.312306 0.210887
H  3.667976 1.81659 -0.348648
H  6.309313 -1.457216 -0.377296
H  4.669338 -0.954401 -0.682519
H  2.666204 3.003142 1.608584
H  1.48733 2.265207 0.550169
H  5.642216 -2.064338 1.989599
H  3.985043 -1.672743 1.592864
H  2.447845 1.100974 3.219852
H  0.935225 1.950093 2.962239
H  4.364505 -4.116408 1.372239
H  5.64487 -3.835137 0.197782
H  3.980142 -3.427195 -0.199478
H  0.133953 -1.361799 -1.277653
H  -1.608642 2.418787 -2.286689
H  -3.728138 -1.413302 1.473226
H  2.268634 -0.635624 -2.233049
H  0.545625 3.149648 -3.237969
H  2.494024 1.624452 -3.210155
totalener: -1856.30780985 hartree
nucrepener: 2520.90199680 hartree
electener: -4377.20980665 hartree
oneelecener: -7553.47837424 hartree
twoeener: 3176.26856759 hartree
kineticenergy: 1850.64928873 hartree
xcener: -138.240730502347 hartree
chargesum: 0.0000000
charge: -0.038221 -0.044649 -0.291372 -0.307601 -0.101972 -0.148287 -0.123215 -0.155145 -0.123325 -0.115775 -0.149937 -0.082613 -0.154911 -0.256133 0.323775 0.138056 0.191807 0.069874 -0.158064 -0.114510 -0.167289 -0.164271 -0.141648 -0.102896 0.145847 0.078815 0.059392 0.075517 0.071658 0.031668 0.082469 0.074107 0.049786 0.079500 0.102731 0.062473 0.043154 0.123731 0.131634 0.086065 0.074662 0.071401 0.131153 0.120220 0.134029 0.132007 0.126244 0.130060
qa: -0.0382 -0.0446 -0.2914 -0.3076 -0.1020 -0.1483 -0.1232 -0.1551 -0.1233 -0.1158 -0.1499 -0.0826 -0.1549 -0.2561 0.3238 0.1381 0.1918 0.0699 -0.1581 -0.1145 -0.1673 -0.1643 -0.1416 -0.1029 0.1458 0.0788 0.0594 0.0755 0.0717 0.0317 0.0825 0.0741 0.0498 0.0795 0.1027 0.0625 0.0432 0.1237 0.1316 0.0861 0.0747 0.0714 0.1312 0.1202 0.1340 0.1320 0.1262 0.1301
va: 1.2615 2.4002 2.1036 2.1894 2.9681 2.9563 3.8778 3.9253 3.8319 3.8629 3.8626 3.8640 3.9101 3.9606 4.3122 3.8864 3.8716 3.5835 3.8906 4.0241 4.0759 3.9132 3.9734 3.9017 4.1892 1.0141 1.0027 1.0097 1.0117 1.0293 1.0135 1.0121 1.0083 1.0137 1.0182 1.0093 1.0066 1.0034 1.0235 1.0057 1.0047 1.0032 1.0166 1.0250 1.0169 1.0016 1.0024 1.0001
dispcorr: -0.027504077 hartree
energy: -1856.335313931412
dipole: 75.01663 -73.12796 1.88867 1.45894 -1.56071 -0.10177 5.53314 -4.56113 0.97201
magnitude: 2.12656 au
magnitude: 5.40528 debye
