program: Orca
programVersion: 5.0.2
elementType: Cl S O O N N C C C C C C C C C C C C C C C C C C C H H H H H H H H H H H H H H H H H H H H H H H
charge: 0
multiplicity: 1
keywords: wb97x-d3
keywords: def2-TZVPP
keywords: def2/J RIJCOSX
keywords: DEFGRID2
keywords: scfconv7
keywords: smallprint printgap noloewdin
keywords: NOSOSCF
formula: C19H23ClN2O2S
InChI: InChI=1/C19H23ClN2O2S/c1-2-3-4-5-6-10-13-25-19(23)24-16-14-17(20)21-22-18(16)15-11-8-7-9-12-15/h7-9,11-12,14H,2-6,10,13H2,1H3
48 atoms
Cl -6.204833 -1.584936 -0.752999
S  1.111812 -2.429092 0.384577
O  -1.173403 -1.733105 -0.410304
O  -0.829746 -1.256955 1.766247
N  -3.479874 1.055694 -0.331604
N  -4.631957 0.445725 -0.44584
C  4.23352 0.905764 1.605292
C  5.388781 1.300746 0.689614
C  3.599653 -0.437652 1.264259
C  4.98458 1.581415 -0.752521
C  2.483866 -0.816504 2.227694
C  6.157395 1.976981 -1.640232
C  1.916936 -2.208757 1.999313
C  5.742903 2.259709 -3.076649
C  -0.437954 -1.699389 0.734477
C  -2.332162 -1.010455 -0.425649
C  -2.335207 0.390188 -0.337708
C  -1.105555 1.195555 -0.220153
C  0.008716 0.94551 -1.018376
C  -1.068173 2.248121 0.691035
C  -3.526165 -1.663631 -0.559042
C  1.144685 1.7301 -0.897302
C  0.071248 3.024203 0.815222
C  1.181065 2.766119 0.023002
C  -4.659391 -0.857257 -0.576489
H  3.463518 1.683924 1.58244
H  4.596834 0.873332 2.637203
H  6.14865 0.511778 0.705485
H  5.876209 2.191522 1.097434
H  4.374457 -1.21315 1.277819
H  3.201721 -0.419129 0.2465
H  4.236909 2.383016 -0.765966
H  4.494259 0.703589 -1.185187
H  2.864597 -0.79144 3.254334
H  1.680084 -0.077744 2.184095
H  6.649761 2.858842 -1.219589
H  6.905967 1.179228 -1.624845
H  2.711058 -2.958159 2.010761
H  1.201531 -2.483113 2.773816
H  6.596858 2.536995 -3.69477
H  5.021793 3.07716 -3.127251
H  5.277737 1.384469 -3.533418
H  -0.010183 0.157605 -1.759468
H  -1.935693 2.450936 1.303871
H  -3.584685 -2.740474 -0.63148
H  2.000711 1.534574 -1.529138
H  0.091942 3.834844 1.531332
H  2.069667 3.377022 0.116753
totalener: -1856.31000053 hartree
nucrepener: 2489.98958625 hartree
electener: -4346.29958678 hartree
oneelecener: -7491.67007944 hartree
twoeener: 3145.37049266 hartree
kineticenergy: 1850.65407407 hartree
xcener: -138.238931512833 hartree
chargesum: 0.0000000
charge: -0.038438 -0.034185 -0.292080 -0.307058 -0.102976 -0.149252 -0.125699 -0.118158 -0.128405 -0.113678 -0.134551 -0.093378 -0.149682 -0.250205 0.312060 0.144710 0.194639 0.075934 -0.177981 -0.123459 -0.168720 -0.142780 -0.131761 -0.125602 0.146056 0.062724 0.079452 0.057158 0.071514 0.071152 0.058726 0.041097 0.054478 0.076568 0.087975 0.054252 0.056075 0.115609 0.130769 0.087838 0.072952 0.071173 0.134432 0.120707 0.133720 0.132356 0.126534 0.137388
qa: -0.0384 -0.0342 -0.2921 -0.3071 -0.1030 -0.1493 -0.1257 -0.1182 -0.1284 -0.1137 -0.1346 -0.0934 -0.1497 -0.2502 0.3121 0.1447 0.1946 0.0759 -0.1780 -0.1235 -0.1687 -0.1428 -0.1318 -0.1256 0.1461 0.0627 0.0795 0.0572 0.0715 0.0712 0.0587 0.0411 0.0545 0.0766 0.0880 0.0543 0.0561 0.1156 0.1308 0.0878 0.0730 0.0712 0.1344 0.1207 0.1337 0.1324 0.1265 0.1374
va: 1.2613 2.3950 2.1010 2.1885 2.9658 2.9568 3.8898 3.9089 3.8323 3.8980 3.8536 3.9183 3.9224 3.9442 4.3117 3.8843 3.8770 3.5734 3.9395 4.0485 4.0757 3.9137 3.9971 3.9088 4.1889 1.0184 1.0142 1.0109 1.0124 1.0149 1.0211 1.0088 1.0052 1.0136 1.0158 1.0087 1.0080 1.0094 1.0226 1.0069 1.0035 1.0040 1.0163 1.0251 1.0171 1.0000 1.0031 0.9931
dispcorr: -0.026689178 hartree
energy: -1856.336689712111
dipole: 77.47020 -75.47036 1.99984 21.02879 -21.79384 -0.76505 2.31515 -2.09106 0.22409
magnitude: 2.15288 au
magnitude: 5.47218 debye
