program: Orca
programVersion: 5.0.2
elementType: Cl S O O N N C C C C C C C C C C C C C C C C C C C H H H H H H H H H H H H H H H H H H H H H H H
charge: 0
multiplicity: 1
keywords: wb97x-d3
keywords: def2-TZVPP
keywords: def2/J RIJCOSX
keywords: DEFGRID2
keywords: scfconv7
keywords: smallprint printgap noloewdin
keywords: NOSOSCF
formula: C19H23ClN2O2S
InChI: InChI=1/C19H23ClN2O2S/c1-2-3-4-5-6-10-13-25-19(23)24-16-14-17(20)21-22-18(16)15-11-8-7-9-12-15/h7-9,11-12,14H,2-6,10,13H2,1H3
48 atoms
Cl -6.290958 -1.827795 -0.754019
S  0.548611 -1.327126 2.145672
O  -1.687133 -0.893339 1.077667
O  -0.358388 -2.196694 -0.194622
N  -3.245618 0.07678 -2.043969
N  -4.423825 -0.480616 -1.931306
C  4.347647 0.605371 0.134302
C  4.816866 1.980298 0.600581
C  3.4308 -0.11204 1.118079
C  5.679556 1.956639 1.85755
C  2.834683 -1.380394 0.525945
C  6.172857 3.331466 2.301828
C  2.012556 -2.196646 1.509812
C  7.133148 3.994957 1.322887
C  -0.537621 -1.563735 0.795782
C  -2.601064 -0.759754 0.071935
C  -2.333061 -0.016622 -1.08862
C  -1.051276 0.666801 -1.343893
C  -0.498226 0.605495 -2.621167
C  -0.396028 1.395978 -0.353471
C  -3.831827 -1.339516 0.212044
C  0.697821 1.244501 -2.897105
C  0.79876 2.039388 -0.635499
C  1.351893 1.960426 -1.904318
C  -4.717342 -1.146949 -0.842788
H  5.218691 -0.023226 -0.078822
H  3.817539 0.716877 -0.816088
H  3.942837 2.618433 0.77733
H  5.371295 2.450486 -0.216052
H  2.624383 0.563526 1.420028
H  3.980149 -0.362106 2.031151
H  6.541267 1.300399 1.691263
H  5.11482 1.50896 2.68003
H  2.228511 -1.137254 -0.350011
H  3.641064 -2.029147 0.167253
H  5.313147 3.986586 2.473547
H  6.66837 3.229298 3.270667
H  1.684392 -3.139934 1.074832
H  2.595104 -2.434962 2.40205
H  7.995028 3.355765 1.122225
H  7.510429 4.938173 1.719002
H  6.658704 4.215633 0.366507
H  -1.011259 0.051422 -3.395131
H  -0.824312 1.494287 0.634757
H  -4.093135 -1.923018 1.083396
H  1.119693 1.185485 -3.891478
H  1.294238 2.610849 0.138244
H  2.284806 2.464055 -2.121274
totalener: -1856.30886886 hartree
nucrepener: 2461.23437737 hartree
electener: -4317.54324623 hartree
oneelecener: -7434.16084845 hartree
twoeener: 3116.61760222 hartree
kineticenergy: 1850.65404937 hartree
xcener: -138.239460855313 hartree
chargesum: -0.0000000
charge: -0.038306 -0.035293 -0.291548 -0.305885 -0.103104 -0.150835 -0.154658 -0.137400 -0.128825 -0.107773 -0.132650 -0.111929 -0.148255 -0.255668 0.309649 0.146509 0.194765 0.075972 -0.126504 -0.171100 -0.167719 -0.122882 -0.164265 -0.125115 0.146680 0.077074 0.075428 0.054064 0.076394 0.060788 0.075595 0.061120 0.068717 0.086528 0.080158 0.052068 0.068225 0.130341 0.114579 0.075550 0.086178 0.073759 0.120696 0.136272 0.133772 0.127341 0.133452 0.138038
qa: -0.0383 -0.0353 -0.2915 -0.3059 -0.1031 -0.1508 -0.1547 -0.1374 -0.1288 -0.1078 -0.1326 -0.1119 -0.1483 -0.2557 0.3096 0.1465 0.1948 0.0760 -0.1265 -0.1711 -0.1677 -0.1229 -0.1643 -0.1251 0.1467 0.0771 0.0754 0.0541 0.0764 0.0608 0.0756 0.0611 0.0687 0.0865 0.0802 0.0521 0.0682 0.1303 0.1146 0.0755 0.0862 0.0738 0.1207 0.1363 0.1338 0.1273 0.1335 0.1380
va: 1.2615 2.3941 2.1003 2.1902 2.9629 2.9581 3.8997 3.8858 3.8209 3.8729 3.8585 3.9139 3.9242 3.9342 4.3143 3.8878 3.8811 3.5742 4.0512 3.9087 4.0744 3.9759 3.9177 3.9019 4.1894 1.0141 1.0150 1.0115 1.0139 1.0234 1.0116 1.0093 1.0140 1.0168 1.0115 1.0093 1.0070 1.0230 1.0104 1.0024 1.0067 1.0022 1.0261 1.0162 1.0172 1.0019 1.0013 0.9951
dispcorr: -0.026014718 hartree
energy: -1856.334883580354
dipole: 82.32014 -80.60660 1.71354 26.56783 -26.66991 -0.10209 12.48149 -11.23002 1.25147
magnitude: 2.12433 au
magnitude: 5.39963 debye
