program: Orca
programVersion: 5.0.2
elementType: Cl S O O N N C C C C C C C C C C C C C C C C C C C H H H H H H H H H H H H H H H H H H H H H H H
charge: 0
multiplicity: 1
keywords: wb97x-d3
keywords: def2-TZVPP
keywords: def2/J RIJCOSX
keywords: DEFGRID2
keywords: scfconv7
keywords: smallprint printgap noloewdin
keywords: NOSOSCF
formula: C19H23ClN2O2S
InChI: InChI=1/C19H23ClN2O2S/c1-2-3-4-5-6-10-13-25-19(23)24-16-14-17(20)21-22-18(16)15-11-8-7-9-12-15/h7-9,11-12,14H,2-6,10,13H2,1H3
48 atoms
Cl -6.203805 -0.511794 0.749195
S  0.878452 -2.834208 0.511714
O  -1.467111 -2.071195 -0.008492
O  -0.232853 -0.471105 0.987248
N  -3.297739 0.726582 -1.395212
N  -4.455568 0.603043 -0.796874
C  3.807668 0.927501 1.282854
C  5.025694 1.774171 1.62965
C  4.138003 -0.235702 0.354295
C  4.693286 2.969056 2.514121
C  2.922613 -1.050545 -0.082164
C  5.907787 3.82085 2.861599
C  2.317715 -1.865829 1.051503
C  5.561285 5.019419 3.733355
C  -0.332528 -1.572947 0.550947
C  -2.47078 -1.183501 -0.270846
C  -2.311308 -0.130726 -1.1858
C  -1.061973 0.106847 -1.933203
C  -0.385577 -0.931693 -2.569189
C  -0.559647 1.402625 -2.022123
C  -3.677815 -1.336018 0.352915
C  0.778701 -0.676165 -3.276828
C  0.609571 1.651824 -2.71984
C  1.282696 0.613063 -3.348037
C  -4.650579 -0.396963 0.025517
H  3.04679 1.555982 0.808447
H  3.354447 0.559875 2.208789
H  5.496187 2.127766 0.705598
H  5.775594 1.149156 2.126754
H  4.876742 -0.892031 0.82782
H  4.623585 0.158139 -0.543284
H  4.219731 2.61855 3.437595
H  3.94477 3.592532 2.013335
H  2.166785 -0.381719 -0.500634
H  3.207069 -1.731624 -0.887471
H  6.652829 3.200767 3.369199
H  6.383606 4.165717 1.938516
H  3.029371 -2.604461 1.42595
H  2.013528 -1.250155 1.896855
H  6.444283 5.614029 3.968184
H  5.114661 4.706263 4.678351
H  4.845445 5.675992 3.236247
H  -0.774388 -1.940967 -2.539839
H  -1.088022 2.211064 -1.535645
H  -3.858486 -2.127172 1.066806
H  1.290387 -1.488837 -3.774758
H  0.99536 2.660985 -2.775813
H  2.19482 0.809814 -3.895797
totalener: -1856.31010998 hartree
nucrepener: 2430.93945071 hartree
electener: -4287.24956068 hartree
oneelecener: -7373.72247930 hartree
twoeener: 3086.47291861 hartree
kineticenergy: 1850.65108488 hartree
xcener: -138.235748280072 hartree
chargesum: -0.0000000
charge: -0.038617 -0.033911 -0.289655 -0.305748 -0.102031 -0.148429 -0.098553 -0.109400 -0.125931 -0.100712 -0.113178 -0.081314 -0.130217 -0.257218 0.306836 0.145960 0.196895 0.051584 -0.147614 -0.109398 -0.172057 -0.165508 -0.143810 -0.098609 0.146984 0.064478 0.052928 0.053403 0.054615 0.062281 0.070082 0.053237 0.054112 0.045604 0.086940 0.052237 0.051420 0.115456 0.113703 0.084381 0.072768 0.073060 0.133464 0.118752 0.133923 0.123154 0.126317 0.127335
qa: -0.0386 -0.0339 -0.2897 -0.3057 -0.1020 -0.1484 -0.0986 -0.1094 -0.1259 -0.1007 -0.1132 -0.0813 -0.1302 -0.2572 0.3068 0.1460 0.1969 0.0516 -0.1476 -0.1094 -0.1721 -0.1655 -0.1438 -0.0986 0.1470 0.0645 0.0529 0.0534 0.0546 0.0623 0.0701 0.0532 0.0541 0.0456 0.0869 0.0522 0.0514 0.1155 0.1137 0.0844 0.0728 0.0731 0.1335 0.1188 0.1339 0.1232 0.1263 0.1273
va: 1.2612 2.4055 2.1050 2.1852 2.9658 2.9558 3.8721 3.8789 3.9213 3.8895 3.9118 3.8878 3.9165 3.9551 4.3115 3.8857 3.8709 3.5873 3.8892 4.0244 4.0736 3.9512 3.9560 3.8930 4.1895 1.0129 1.0159 1.0134 1.0117 1.0108 1.0137 1.0110 1.0112 1.0237 1.0159 1.0078 1.0078 1.0119 1.0271 1.0061 1.0032 1.0033 1.0151 1.0254 1.0173 1.0057 1.0022 0.9992
dispcorr: -0.024237682 hartree
energy: -1856.334347657351
dipole: 77.27749 -75.46075 1.81675 27.13178 -28.10958 -0.97780 14.70739 -14.46353 0.24386
magnitude: 2.07753 au
magnitude: 5.28067 debye
