program: Orca
programVersion: 5.0.2
elementType: Cl S O O N N C C C C C C C C C C C C C C C C C C C H H H H H H H H H H H H H H H H H H H H H H H
charge: 0
multiplicity: 1
keywords: wb97x-d3
keywords: def2-TZVPP
keywords: def2/J RIJCOSX
keywords: DEFGRID2
keywords: scfconv7
keywords: smallprint printgap noloewdin
keywords: NOSOSCF
formula: C19H23ClN2O2S
InChI: InChI=1/C19H23ClN2O2S/c1-2-3-4-5-6-10-13-25-19(23)24-16-14-17(20)21-22-18(16)15-11-8-7-9-12-15/h7-9,11-12,14H,2-6,10,13H2,1H3
48 atoms
Cl -6.066988 -1.926839 -0.291922
S  0.791801 -0.361562 2.17638
O  -1.231266 -1.014725 0.821813
O  -1.232667 1.165402 1.3919
N  -3.274449 0.072931 -1.960449
N  -4.426749 -0.476538 -1.669049
C  4.418485 1.358711 1.797927
C  5.649133 0.751898 1.129993
C  3.20371 1.451665 0.881681
C  5.501209 -0.723704 0.775232
C  1.97866 2.086486 1.527555
C  6.783137 -1.336647 0.225349
C  1.375899 1.287055 2.674459
C  6.635374 -2.81226 -0.116079
C  -0.712946 0.095728 1.410526
C  -2.302774 -0.839956 -0.006137
C  -2.21029 -0.095041 -1.191998
C  -0.9666 0.565115 -1.631677
C  0.250353 -0.112194 -1.648393
C  -1.015772 1.891287 -2.052113
C  -3.495822 -1.429006 0.309142
C  1.401731 0.533821 -2.07115
C  0.138426 2.536685 -2.461525
C  1.350522 1.860517 -2.469946
C  -4.533613 -1.213995 -0.592295
H  4.664159 2.361754 2.161264
H  4.181661 0.76704 2.688867
H  6.507264 0.86827 1.798969
H  5.894757 1.322597 0.227651
H  2.932904 0.463183 0.501378
H  3.469897 2.042904 0.000459
H  4.698836 -0.858571 0.042766
H  5.188112 -1.279194 1.66653
H  2.242048 3.072799 1.924297
H  1.212332 2.26003 0.769536
H  7.097478 -0.783211 -0.664792
H  7.587084 -1.209463 0.956783
H  2.106613 1.091225 3.46026
H  0.544051 1.817696 3.135796
H  5.863611 -2.969529 -0.871423
H  6.355279 -3.395454 0.762699
H  7.564398 -3.229428 -0.505016
H  0.304268 -1.152708 -1.356011
H  -1.961804 2.415085 -2.045435
H  -3.627234 -2.012623 1.209332
H  2.340733 -0.003308 -2.089939
H  0.091216 3.570542 -2.776617
H  2.251727 2.364657 -2.793625
totalener: -1856.30847494 hartree
nucrepener: 2478.92920868 hartree
electener: -4335.23768362 hartree
oneelecener: -7469.56260626 hartree
twoeener: 3134.32492264 hartree
kineticenergy: 1850.65391139 hartree
xcener: -138.239263823530 hartree
chargesum: 0.0000000
charge: -0.038402 -0.033441 -0.289414 -0.306757 -0.100963 -0.147918 -0.124738 -0.118205 -0.119987 -0.102674 -0.151409 -0.087057 -0.158662 -0.251277 0.315300 0.144787 0.187733 0.063649 -0.153528 -0.111024 -0.170637 -0.159545 -0.138257 -0.109656 0.146129 0.076864 0.056664 0.069970 0.057877 0.040050 0.076368 0.049639 0.053780 0.080342 0.099684 0.053621 0.053542 0.121085 0.131173 0.070113 0.072779 0.085536 0.131365 0.119004 0.133980 0.126774 0.126258 0.129485
qa: -0.0384 -0.0334 -0.2894 -0.3068 -0.1010 -0.1479 -0.1247 -0.1182 -0.1200 -0.1027 -0.1514 -0.0871 -0.1587 -0.2513 0.3153 0.1448 0.1877 0.0636 -0.1535 -0.1110 -0.1706 -0.1595 -0.1383 -0.1097 0.1461 0.0769 0.0567 0.0700 0.0579 0.0400 0.0764 0.0496 0.0538 0.0803 0.0997 0.0536 0.0535 0.1211 0.1312 0.0701 0.0728 0.0855 0.1314 0.1190 0.1340 0.1268 0.1263 0.1295
va: 1.2611 2.3971 2.1063 2.1902 2.9666 2.9550 3.9177 3.9026 3.8469 3.8672 3.8625 3.8957 3.9141 3.9518 4.3103 3.8819 3.8781 3.5866 3.8838 4.0259 4.0749 3.9247 3.9736 3.8991 4.1890 1.0127 1.0104 1.0126 1.0136 1.0247 1.0119 1.0086 1.0115 1.0136 1.0194 1.0070 1.0090 1.0052 1.0236 1.0039 1.0033 1.0064 1.0159 1.0242 1.0173 1.0024 1.0022 1.0006
dispcorr: -0.026080709 hartree
energy: -1856.334555645342
dipole: 79.54192 -77.67749 1.86443 9.93493 -9.86261 0.07232 7.49727 -6.43777 1.05951
magnitude: 2.14567 au
magnitude: 5.45385 debye
