program: Orca
programVersion: 5.0.2
elementType: Cl S O O N N C C C C C C C C C C C C C C C C C C C H H H H H H H H H H H H H H H H H H H H H H H
charge: 0
multiplicity: 1
keywords: wb97x-d3
keywords: def2-TZVPP
keywords: def2/J RIJCOSX
keywords: DEFGRID2
keywords: scfconv7
keywords: smallprint printgap noloewdin
keywords: NOSOSCF
formula: C19H23ClN2O2S
InChI: InChI=1/C19H23ClN2O2S/c1-2-3-4-5-6-10-13-25-19(23)24-16-14-17(20)21-22-18(16)15-11-8-7-9-12-15/h7-9,11-12,14H,2-6,10,13H2,1H3
48 atoms
Cl -5.553325 0.279597 -2.247964
S  1.058199 -2.891405 -1.026496
O  -1.294368 -1.994713 -0.794171
O  0.235872 -0.370179 -1.090558
N  -3.208097 0.669885 0.740663
N  -4.182601 0.819079 -0.120701
C  3.63716 0.913035 -0.019366
C  4.734025 1.968965 -0.00199
C  4.128666 -0.472932 0.383914
C  4.216115 3.365823 -0.319247
C  3.017337 -1.520525 0.394235
C  5.303699 4.43194 -0.318502
C  2.626374 -1.974258 -1.006433
C  4.767978 5.822696 -0.627212
C  -0.032427 -1.523734 -0.977432
C  -2.267559 -1.063373 -0.565563
C  -2.265209 -0.24466 0.575151
C  -1.224297 -0.311654 1.618234
C  -0.784401 -1.527966 2.135625
C  -0.681316 0.873187 2.109222
C  -3.286169 -0.931648 -1.468205
C  0.19062 -1.555853 3.121049
C  0.299047 0.84079 3.086013
C  0.739594 -0.373826 3.593383
C  -4.236017 0.040582 -1.172546
H  3.181816 0.884814 -1.014052
H  2.832175 1.210289 0.660933
H  5.5165 1.697464 -0.719011
H  5.217884 1.976138 0.981039
H  4.562131 -0.415525 1.386468
H  4.944541 -0.791525 -0.27481
H  3.442881 3.637027 0.407659
H  3.717617 3.357179 -1.294523
H  3.323312 -2.395754 0.971669
H  2.148278 -1.104946 0.90932
H  5.803684 4.439532 0.654897
H  6.073401 4.16507 -1.048982
H  2.536328 -1.142711 -1.704127
H  3.3671 -2.66137 -1.418915
H  4.288256 5.853663 -1.606835
H  5.562559 6.569126 -0.62652
H  4.025237 6.132648 0.109729
H  -1.214624 -2.45991 1.793575
H  -1.027558 1.818817 1.715381
H  -3.337389 -1.532458 -2.365417
H  0.518441 -2.506035 3.520658
H  0.718898 1.767492 3.45387
H  1.504338 -0.397836 4.358513
totalener: -1856.30934313 hartree
nucrepener: 2465.81917122 hartree
electener: -4322.12851435 hartree
oneelecener: -7443.54907252 hartree
twoeener: 3121.42055817 hartree
kineticenergy: 1850.64763649 hartree
xcener: -138.235402129446 hartree
chargesum: 0.0000000
charge: -0.038312 -0.031020 -0.290481 -0.310418 -0.102654 -0.148911 -0.082999 -0.108111 -0.141259 -0.096778 -0.078897 -0.079756 -0.149417 -0.256413 0.314369 0.143938 0.195021 0.050185 -0.142669 -0.094347 -0.169355 -0.168850 -0.173877 -0.077218 0.147467 0.058928 0.049307 0.053296 0.051435 0.070957 0.063671 0.050902 0.054291 0.092715 0.019065 0.050498 0.050949 0.114755 0.119432 0.072796 0.083929 0.072111 0.131892 0.118536 0.133470 0.123132 0.126893 0.127802
qa: -0.0383 -0.0310 -0.2905 -0.3104 -0.1027 -0.1489 -0.0830 -0.1081 -0.1413 -0.0968 -0.0789 -0.0798 -0.1494 -0.2564 0.3144 0.1439 0.1950 0.0502 -0.1427 -0.0943 -0.1694 -0.1689 -0.1739 -0.0772 0.1475 0.0589 0.0493 0.0533 0.0514 0.0710 0.0637 0.0509 0.0543 0.0927 0.0191 0.0505 0.0509 0.1148 0.1194 0.0728 0.0839 0.0721 0.1319 0.1185 0.1335 0.1231 0.1269 0.1278
va: 1.2615 2.4075 2.1068 2.1740 2.9645 2.9564 3.8800 3.8790 3.9366 3.8895 3.8964 3.8863 3.9198 3.9552 4.2965 3.8840 3.8713 3.5978 3.8823 3.9985 4.0759 3.9510 3.9590 3.8700 4.1893 1.0196 1.0160 1.0130 1.0126 1.0121 1.0102 1.0115 1.0113 1.0147 1.0302 1.0078 1.0082 1.0258 1.0102 1.0034 1.0061 1.0034 1.0161 1.0254 1.0175 1.0056 1.0027 0.9985
dispcorr: -0.025011328 hartree
energy: -1856.334354455790
dipole: 70.26467 -68.57893 1.68574 25.52648 -26.63561 -1.10913 11.24864 -11.32662 -0.07799
magnitude: 2.01939 au
magnitude: 5.13289 debye
